id_mutation,date_mutation,numero_disposition,nature_mutation,valeur_fonciere,adresse_numero,adresse_suffixe,adresse_nom_voie,adresse_code_voie,code_postal,code_commune,nom_commune,code_departement,ancien_code_commune,ancien_nom_commune,id_parcelle,ancien_id_parcelle,numero_volume,lot1_numero,lot1_surface_carrez,lot2_numero,lot2_surface_carrez,lot3_numero,lot3_surface_carrez,lot4_numero,lot4_surface_carrez,lot5_numero,lot5_surface_carrez,nombre_lots,code_type_local,type_local,surface_reelle_bati,nombre_pieces_principales,code_nature_culture,nature_culture,code_nature_culture_speciale,nature_culture_speciale,surface_terrain,longitude,latitude
2020-105585,2020-03-05,000001,Vente,65000,52,,HAM DE GESSE,B054,11140,11038,Bessède-de-Sault,11,,,110380000A1946,,,,,,,,,,,,,0,1,Maison,87,6,S,sols,,,875,2.159843,42.775353
2020-106787,2020-06-23,000001,Vente,72000,80,,LE VILLAGE,B094,11140,11038,Bessède-de-Sault,11,,,110380000A2064,,,,,,,,,,,,,0,1,Maison,120,5,S,sols,,,130,2.125482,42.788842
2020-106787,2020-06-23,000001,Vente,72000,,,LE SOUGRA,B088,11140,11038,Bessède-de-Sault,11,,,110380000B1740,,,,,,,,,,,,,0,,,,,T,terres,,,1149,2.118869,42.793717
2020-107351,2020-07-24,000001,Vente,6000,,,LE PLA-EST,B069,11140,11038,Bessède-de-Sault,11,,,110380000A0868,,,,,,,,,,,,,0,,,,,T,terres,,,675,2.133667,42.794461
2020-107351,2020-07-24,000001,Vente,6000,,,COUMO DAOULENS,B036,11140,11038,Bessède-de-Sault,11,,,110380000A0896,,,,,,,,,,,,,0,,,,,L,landes,,,765,2.134249,42.794431
2020-107351,2020-07-24,000001,Vente,6000,,,LA FAJOLE,B044,11140,11038,Bessède-de-Sault,11,,,110380000A1133,,,,,,,,,,,,,0,,,,,T,terres,,,660,2.130228,42.789569
2020-107351,2020-07-24,000001,Vente,6000,,,BITAREL,B013,11140,11038,Bessède-de-Sault,11,,,110380000A1808,,,,,,,,,,,,,0,,,,,L,landes,,,1990,2.151416,42.776807
2020-107351,2020-07-24,000001,Vente,6000,,,LE VILLAGE,B094,11140,11038,Bessède-de-Sault,11,,,110380000A1955,,,,,,,,,,,,,0,,,,,T,terres,,,329,2.126494,42.789142
2020-107351,2020-07-24,000001,Vente,6000,,,LE VILLAGE,B094,11140,11038,Bessède-de-Sault,11,,,110380000A1956,,,,,,,,,,,,,0,,,,,J,jardins,POTAG,Jardin potager,107,2.12641,42.789089
2020-107351,2020-07-24,000001,Vente,6000,,,LE VILLAGE,B094,11140,11038,Bessède-de-Sault,11,,,110380000A1957,,,,,,,,,,,,,0,,,,,S,sols,,,73,2.126386,42.789163
2020-107351,2020-07-24,000001,Vente,6000,,,SABIS,B081,11140,11038,Bessède-de-Sault,11,,,110380000B1137,,,,,,,,,,,,,0,,,,,L,landes,,,1000,2.128179,42.798506
2020-107351,2020-07-24,000001,Vente,6000,,,LE BAZEL,B008,11140,11038,Bessède-de-Sault,11,,,110380000B1873,,,,,,,,,,,,,0,,,,,L,landes,,,1240,2.118747,42.790543
2020-107351,2020-07-24,000001,Vente,6000,,,LA HORTE,B056,11140,11038,Bessède-de-Sault,11,,,110380000B2025,,,,,,,,,,,,,0,,,,,L,landes,,,1610,2.115264,42.791854
2020-108243,2020-09-22,000001,Vente,1500,,,LE VILLAGE,B094,11140,11038,Bessède-de-Sault,11,,,110380000A0371,,,,,,,,,,,,,0,,,,,L,landes,,,346,2.123463,42.789071
2020-108983,2020-10-20,000001,Vente,1500,,,LE VILLAGE,B094,11140,11038,Bessède-de-Sault,11,,,110380000A0372,,,,,,,,,,,,,0,,,,,L,landes,,,412,2.123658,42.789181
2020-109752,2020-11-26,000001,Vente,67000,,,LE VILLAGE,B094,11140,11038,Bessède-de-Sault,11,,,110380000A0074,,,,,,,,,,,,,0,,,,,J,jardins,POTAG,Jardin potager,61,2.124998,42.789447
2020-109752,2020-11-26,000001,Vente,67000,143,,LE VILLAGE,B094,11140,11038,Bessède-de-Sault,11,,,110380000A1938,,,,,,,,,,,,,0,1,Maison,60,2,S,sols,,,87,2.12498,42.789607
2020-109752,2020-11-26,000001,Vente,67000,149,,LE VILLAGE,B094,11140,11038,Bessède-de-Sault,11,,,110380000A1939,,,,,,,,,,,,,0,3,Dépendance,,0,S,sols,,,54,2.125066,42.789503
2020-110148,2020-12-18,000001,Vente,7000,,,LE VILLAGE,B094,11140,11038,Bessède-de-Sault,11,,,110380000A1977,,,,,,,,,,,,,0,,,,,S,sols,,,19,2.124771,42.789176
2020-110148,2020-12-18,000001,Vente,7000,,,LE VILLAGE,B094,11140,11038,Bessède-de-Sault,11,,,110380000A1978,,,,,,,,,,,,,0,,,,,S,sols,,,21,2.124733,42.789125
