id_mutation,date_mutation,numero_disposition,nature_mutation,valeur_fonciere,adresse_numero,adresse_suffixe,adresse_nom_voie,adresse_code_voie,code_postal,code_commune,nom_commune,code_departement,ancien_code_commune,ancien_nom_commune,id_parcelle,ancien_id_parcelle,numero_volume,lot1_numero,lot1_surface_carrez,lot2_numero,lot2_surface_carrez,lot3_numero,lot3_surface_carrez,lot4_numero,lot4_surface_carrez,lot5_numero,lot5_surface_carrez,nombre_lots,code_type_local,type_local,surface_reelle_bati,nombre_pieces_principales,code_nature_culture,nature_culture,code_nature_culture_speciale,nature_culture_speciale,surface_terrain,longitude,latitude
2020-104551,2020-01-10,000001,Vente,133000,100,,RUE DE LA POSTE,0057,11400,11195,Laurabuc,11,,,111950000A0105,,,,,,,,,,,,,0,1,Maison,58,3,S,sols,,,68,1.980783,43.246878
2020-104551,2020-01-10,000001,Vente,133000,23,,RUE DE LA MAIRIE,0046,11400,11195,Laurabuc,11,,,111950000A0106,,,,,,,,,,,,,0,,,,,L,landes,,,65,1.980755,43.246941
2020-104854,2020-01-29,000001,Vente,27000,120,,LE VILLAGE,B094,11400,11195,Laurabuc,11,,,111950000A0014,,,,,,,,,,,,,0,1,Maison,56,2,S,sols,,,40,1.981596,43.247985
2020-105068,2020-02-14,000001,Vente,39000,,,LE CAMMAS,B013,11400,11195,Laurabuc,11,,,11195000ZS0049,,,,,,,,,,,,,0,,,,,AB,terrains a bâtir,,,1702,1.99208,43.26241
2020-105682,2020-03-31,000001,Vente,82083,,,RIBALBOURT,B072,11400,11195,Laurabuc,11,,,111950000A0476,,,,,,,,,,,,,0,,,,,L,landes,,,2440,1.986007,43.244541
2020-105682,2020-03-31,000001,Vente,82083,,,RIBALBOURT,B072,11400,11195,Laurabuc,11,,,111950000A0477,,,,,,,,,,,,,0,,,,,L,landes,,,940,1.985981,43.244306
2020-105682,2020-03-31,000001,Vente,82083,,,LA SALE,B077,11400,11195,Laurabuc,11,,,11195000ZQ0034,,,,,,,,,,,,,0,,,,,T,terres,,,47080,1.988313,43.250023
2020-105682,2020-03-31,000001,Vente,82083,,,BRAGOT,B008,11400,11195,Laurabuc,11,,,11195000ZU0107,,,,,,,,,,,,,0,,,,,T,terres,,,67460,1.972473,43.247547
2020-105682,2020-03-31,000001,Vente,82083,,,BRAGOT,B008,11400,11195,Laurabuc,11,,,11195000ZU0185,,,,,,,,,,,,,0,,,,,T,terres,,,46192,1.973739,43.249055
2020-105865,2020-04-17,000001,Vente,50000,89,,CARTEVIEILLE,B018,11400,11195,Laurabuc,11,,,11195000ZO0077,,,,,,,,,,,,,0,1,Maison,116,4,S,sols,,,2497,2.004689,43.25762
2020-105865,2020-04-17,000001,Vente,50000,89,,CARTEVIEILLE,B018,11400,11195,Laurabuc,11,,,11195000ZO0077,,,,,,,,,,,,,0,1,Maison,116,4,T,terres,,,1319,2.004689,43.25762
2020-106345,2020-05-29,000001,Vente,22000,,,LES PRATANIERS,B068,11400,11195,Laurabuc,11,,,11195000WA0002,,,,,,,,,,,,,0,,,,,T,terres,,,13703,,
2020-107664,2020-07-31,000001,Vente,2000,,,LES CAMAYRANS SUD,B010,11400,11195,Laurabuc,11,,,11195000ZQ0002,,,,,,,,,,,,,0,,,,,T,terres,,,3130,1.987658,43.250764
2020-107868,2020-08-04,000001,Vente,30000,10,,RUE DE LA PRISON,0058,11400,11195,Laurabuc,11,,,111950000A0990,,,,,,,,,,,,,0,,,,,S,sols,,,82,1.979983,43.247251
2020-107875,2020-08-04,000002,Vente,262570,58,,RUE CENTRALE,0017,11400,11195,Laurabuc,11,,,111950000A0989,,,,,,,,,,,,,0,1,Maison,193,5,S,sols,,,653,1.980035,43.247112
2020-108274,2020-09-02,000001,Vente,2000,,,LES CAMAYRANS SUD,B010,11400,11195,Laurabuc,11,,,11195000ZQ0003,,,,,,,,,,,,,0,,,,,T,terres,,,2620,1.988351,43.25095
2020-108363,2020-09-22,000001,Vente,197000,75,,LE CAPABLE,B017,11400,11195,Laurabuc,11,,,11195000ZS0023,,,,,,,,,,,,,0,1,Maison,155,5,S,sols,,,3000,1.993315,43.264508
2020-108363,2020-09-22,000001,Vente,197000,75,,LE CAPABLE,B017,11400,11195,Laurabuc,11,,,11195000ZS0023,,,,,,,,,,,,,0,1,Maison,155,5,T,terres,,,6548,1.993315,43.264508
2020-108366,2020-09-21,000001,Vente,220000,113,,LE SEGALA-NORD,B083,11400,11195,Laurabuc,11,,,11195000ZR0022,,,,,,,,,,,,,0,1,Maison,113,5,T,terres,,,2270,1.993976,43.259241
2020-108366,2020-09-21,000001,Vente,220000,113,,LE SEGALA-NORD,B083,11400,11195,Laurabuc,11,,,11195000ZR0022,,,,,,,,,,,,,0,1,Maison,113,5,S,sols,,,500,1.993976,43.259241
2020-109195,2020-10-22,000001,Vente,4000,39,,LE VILLAGE,B094,11400,11195,Laurabuc,11,,,111950000A0127,,,,,,,,,,,,,0,1,Maison,90,4,S,sols,,,109,1.98086,43.247211
2020-109195,2020-10-22,000001,Vente,4000,,,LE VILLAGE,B094,11400,11195,Laurabuc,11,,,111950000A0128,,,,,,,,,,,,,0,,,,,S,sols,,,65,1.98095,43.247234
2020-109201,2020-10-30,000001,Vente,2000,,,LE COUSTELAS,B027,11400,11195,Laurabuc,11,,,111950000A0519,,,,,,,,,,,,,0,,,,,J,jardins,POTAG,Jardin potager,810,1.982073,43.246752
2020-109411,2020-11-09,000001,Vente,43000,,,LE CAMMAS,B013,11400,11195,Laurabuc,11,,,11195000ZS0048,,,,,,,,,,,,,0,,,,,AB,terrains a bâtir,,,1701,1.992308,43.262624
2020-109689,2020-11-27,000002,Vente,128000,72,A,LA PERIOLE,B064,11400,11195,Laurabuc,11,,,111950000A0579,,,,,,,,,,,,,0,1,Maison,100,4,S,sols,,,520,1.979138,43.247487
2020-109689,2020-11-27,000002,Vente,128000,,,LA PERIOLE,B064,11400,11195,Laurabuc,11,,,11195000ZU0231,,,,,,,,,,,,,0,,,,,T,terres,,,1275,1.979096,43.247409
2020-109692,2020-11-13,000001,Vente,29000,42,,LE VILLAGE,B094,11400,11195,Laurabuc,11,,,111950000A0137,,,,,,,,,,,,,0,1,Maison,85,3,S,sols,,,56,1.98095,43.247419
2020-110271,2020-12-30,000001,Vente,22000,32,,LE VILLAGE,B094,11400,11195,Laurabuc,11,,,111950000A0103,,,,,,,,,,,,,0,1,Maison,55,2,S,sols,,,82,1.980587,43.246899
