id_mutation,date_mutation,numero_disposition,nature_mutation,valeur_fonciere,adresse_numero,adresse_suffixe,adresse_nom_voie,adresse_code_voie,code_postal,code_commune,nom_commune,code_departement,ancien_code_commune,ancien_nom_commune,id_parcelle,ancien_id_parcelle,numero_volume,lot1_numero,lot1_surface_carrez,lot2_numero,lot2_surface_carrez,lot3_numero,lot3_surface_carrez,lot4_numero,lot4_surface_carrez,lot5_numero,lot5_surface_carrez,nombre_lots,code_type_local,type_local,surface_reelle_bati,nombre_pieces_principales,code_nature_culture,nature_culture,code_nature_culture_speciale,nature_culture_speciale,surface_terrain,longitude,latitude
2020-104983,2020-02-04,000001,Vente,52000,26,,VILLAGE,B047,11400,11292,La Pomarède,11,,,11292000ZE0062,,,,,,,,,,,,,0,1,Maison,59,3,S,sols,,,200,1.949182,43.4048
2020-107048,2020-06-30,000001,Vente,80000,,,LE BOURDIC,B007,11400,11292,La Pomarède,11,,,11292000ZH0029,,,,,,,,,,,,,0,,,,,T,terres,,,520,1.957555,43.402798
2020-107048,2020-06-30,000001,Vente,80000,,,LE BOURDIC,B007,11400,11292,La Pomarède,11,,,11292000ZH0035,,,,,,,,,,,,,0,,,,,T,terres,,,3550,1.957474,43.402305
2020-107048,2020-06-30,000001,Vente,80000,76,,LE BOURDIC,B007,11400,11292,La Pomarède,11,,,11292000ZH0042,,,,,,,,,,,,,0,4,Local industriel. commercial ou assimilé,900,0,S,sols,,,3174,1.958035,43.401906
2020-107049,2020-06-30,000002,Vente,120000,,,LE BOURDIC,B007,11400,11292,La Pomarède,11,,,11292000ZH0029,,,,,,,,,,,,,0,,,,,T,terres,,,520,1.957555,43.402798
2020-107049,2020-06-30,000002,Vente,120000,34,,LE BOURDIC,B007,11400,11292,La Pomarède,11,,,11292000ZH0034,,,,,,,,,,,,,0,1,Maison,64,3,S,sols,,,500,1.957165,43.402217
2020-107049,2020-06-30,000002,Vente,120000,34,,LE BOURDIC,B007,11400,11292,La Pomarède,11,,,11292000ZH0034,,,,,,,,,,,,,0,1,Maison,64,3,T,terres,,,1000,1.957165,43.402217
2020-107049,2020-06-30,000002,Vente,120000,,,LE BOURDIC,B007,11400,11292,La Pomarède,11,,,11292000ZH0035,,,,,,,,,,,,,0,,,,,T,terres,,,3550,1.957474,43.402305
2020-107049,2020-06-30,000002,Vente,120000,76,,LE BOURDIC,B007,11400,11292,La Pomarède,11,,,11292000ZH0042,,,,,,,,,,,,,0,4,Local industriel. commercial ou assimilé,900,0,S,sols,,,3174,1.958035,43.401906
2020-110369,2020-12-22,000001,Vente,50000,,,VILLAGE,B047,11400,11292,La Pomarède,11,,,11292000ZE0056,,,,,,,,,,,,,0,,,,,T,terres,,,600,1.94765,43.406022
2020-110369,2020-12-22,000001,Vente,50000,21,,VILLAGE,B047,11400,11292,La Pomarède,11,,,11292000ZE0057,,,,,,,,,,,,,0,1,Maison,40,2,S,sols,,,200,1.948159,43.405552
2020-110369,2020-12-22,000001,Vente,50000,21,,VILLAGE,B047,11400,11292,La Pomarède,11,,,11292000ZE0057,,,,,,,,,,,,,0,1,Maison,40,2,T,terres,,,9220,1.948159,43.405552
2020-110369,2020-12-22,000001,Vente,50000,,,CABRERIE,B010,11400,11292,La Pomarède,11,,,11292000ZE0086,,,,,,,,,,,,,0,,,,,S,sols,,,30,1.949017,43.405588
