id_mutation,date_mutation,numero_disposition,nature_mutation,valeur_fonciere,adresse_numero,adresse_suffixe,adresse_nom_voie,adresse_code_voie,code_postal,code_commune,nom_commune,code_departement,ancien_code_commune,ancien_nom_commune,id_parcelle,ancien_id_parcelle,numero_volume,lot1_numero,lot1_surface_carrez,lot2_numero,lot2_surface_carrez,lot3_numero,lot3_surface_carrez,lot4_numero,lot4_surface_carrez,lot5_numero,lot5_surface_carrez,nombre_lots,code_type_local,type_local,surface_reelle_bati,nombre_pieces_principales,code_nature_culture,nature_culture,code_nature_culture_speciale,nature_culture_speciale,surface_terrain,longitude,latitude
2020-104667,2020-01-15,000001,Vente,34000,,,LA LAUZE PLANE,B068,11150,11418,Villasavary,11,,,11418000ZH0011,,,,,,,,,,,,,0,,,,,T,terres,,,26060,2.062853,43.246613
2020-105564,2020-03-06,000001,Vente,73000,72,,LE VILLAGE,B155,11150,11418,Villasavary,11,,,114180000D1946,,,,,,,,,,,,,0,1,Maison,120,6,S,sols,,,445,2.041265,43.220497
2020-105839,2020-04-09,000001,Vente,38800,,,LA NOUGAREDE OUEST,B084,11150,11418,Villasavary,11,,,114180000E0686,,,,,,,,,,,,,0,,,,,AB,terrains a bâtir,,,388,2.041168,43.216648
2020-105992,2020-04-29,000001,Vente,7000,,,L HORTE,B060,11150,11418,Villasavary,11,,,114180000B0768,,,,,,,,,,,,,0,,,,,T,terres,,,3560,2.036203,43.22523
2020-105992,2020-04-29,000001,Vente,7000,,,L HORTE,B060,11150,11418,Villasavary,11,,,114180000B0769,,,,,,,,,,,,,0,,,,,T,terres,,,4140,2.03614,43.224583
2020-106211,2020-05-22,000001,Vente,80000,1,,RUE DE MONTPLAISIR,0069,11150,11418,Villasavary,11,,,114180000D1619,,,,,,,,,,,,,0,1,Maison,131,4,S,sols,,,520,2.038174,43.218184
2020-106211,2020-05-22,000001,Vente,80000,,,LE VILLAGE,B155,11150,11418,Villasavary,11,,,114180000D1866,,,,,,,,,,,,,0,,,,,L,landes,,,40,2.038021,43.218226
2020-106214,2020-05-26,000002,Vente,30000,69,,RUE DU BARRY,0009,11150,11418,Villasavary,11,,,114180000D2021,,,,,,,,,,,,,0,,,,,S,sols,,,128,2.040854,43.219597
2020-106281,2020-05-14,000001,Vente,15000,,,LE VILLAGE,B155,11150,11418,Villasavary,11,,,114180000D0089,,,,,,,,,,,,,0,,,,,S,sols,,,36,2.040557,43.221366
2020-106281,2020-05-14,000001,Vente,15000,,,LE VILLAGE,B155,11150,11418,Villasavary,11,,,114180000D1760,,,,,,,,,,,,,0,,,,,S,sols,,,16,2.04053,43.221373
2020-106966,2020-07-02,000001,Vente,78000,100,,LE VILLAGE,B155,11150,11418,Villasavary,11,,,114180000D0233,,,,,,,,,,,,,0,1,Maison,123,4,S,sols,,,92,2.039257,43.221017
2020-106966,2020-07-02,000001,Vente,78000,,,LE VILLAGE,B155,11150,11418,Villasavary,11,,,114180000D1530,,,,,,,,,,,,,0,,,,,S,sols,,,52,2.03921,43.22097
2020-107687,2020-08-11,000001,Vente,82000,43,,LE VILLAGE,B155,11150,11418,Villasavary,11,,,114180000D0139,,,,,,,,,,,,,0,1,Maison,100,7,S,sols,,,28,2.039194,43.22146
2020-107687,2020-08-11,000001,Vente,82000,,,LE VILLAGE,B155,11150,11418,Villasavary,11,,,114180000D0140,,,,,,,,,,,,,0,,,,,S,sols,,,84,2.039312,43.22145
2020-107687,2020-08-11,000001,Vente,82000,,,LE VILLAGE,B155,11150,11418,Villasavary,11,,,114180000D0141,,,,,,,,,,,,,0,,,,,S,sols,,,137,2.039281,43.221495
2020-107781,2020-08-20,000001,Vente,54,,,LE VILLAGE,B155,11150,11418,Villasavary,11,,,114180000D0253,,,,,,,,,,,,,0,,,,,L,landes,,,27,2.039373,43.22131
2020-107998,2020-08-31,000001,Vente,76000,1,,LE VILLAGE,B155,11150,11418,Villasavary,11,,,114180000D1962,,,,,,,,,,,,,0,1,Maison,100,4,S,sols,,,1575,2.037447,43.222546
2020-107998,2020-08-31,000001,Vente,76000,,,LE VILLAGE,B155,11150,11418,Villasavary,11,,,114180000D1965,,,,,,,,,,,,,0,,,,,BT,taillis simples,,,349,2.037478,43.222792
2020-108085,2020-08-31,000001,Vente,150,,,L HORTE,B060,11150,11418,Villasavary,11,,,114180000B0971,,,,,,,,,,,,,0,,,,,T,terres,,,215,2.037207,43.22289
2020-108256,2020-09-07,000001,Vente,360000,,,PIJOL-RANG,B097,11150,11418,Villasavary,11,,,114180000F0077,,,,,,,,,,,,,0,,,,,L,landes,,,910,2.022278,43.221787
2020-108256,2020-09-07,000001,Vente,360000,,,CLOT DE LA GARRIGUETAIRE,B027,11150,11418,Villasavary,11,,,114180000F0484,,,,,,,,,,,,,0,,,,,L,landes,,,2305,2.015045,43.227264
2020-108256,2020-09-07,000001,Vente,360000,,,LA GOUTINE-EST,B054,11150,11418,Villasavary,11,,,114180000F0521,,,,,,,,,,,,,0,,,,,L,landes,,,2030,2.015739,43.223588
2020-108256,2020-09-07,000001,Vente,360000,,,LA GOUTINE-EST,B054,11150,11418,Villasavary,11,,,114180000F0522,,,,,,,,,,,,,0,,,,,L,landes,,,3500,2.015299,43.223441
2020-108256,2020-09-07,000001,Vente,360000,328,,LA GOUTINE-OUEST,B055,11150,11418,Villasavary,11,,,11418000ZW0010,,,,,,,,,,,,,0,1,Maison,153,5,T,terres,,,6764,2.024021,43.224714
2020-108256,2020-09-07,000001,Vente,360000,328,,LA GOUTINE-OUEST,B055,11150,11418,Villasavary,11,,,11418000ZW0010,,,,,,,,,,,,,0,1,Maison,153,5,S,sols,,,1219,2.024021,43.224714
2020-108256,2020-09-07,000001,Vente,360000,328,,LA GOUTINE-OUEST,B055,11150,11418,Villasavary,11,,,11418000ZW0010,,,,,,,,,,,,,0,1,Maison,153,5,T,terres,,,2153,2.024021,43.224714
2020-108256,2020-09-07,000001,Vente,360000,328,,LA GOUTINE-OUEST,B055,11150,11418,Villasavary,11,,,11418000ZW0010,,,,,,,,,,,,,0,1,Maison,153,5,T,terres,,,6764,2.024021,43.224714
2020-108256,2020-09-07,000001,Vente,360000,,,LA GOUTINE-OUEST,B055,11150,11418,Villasavary,11,,,11418000ZX0057,,,,,,,,,,,,,0,,,,,T,terres,,,7720,2.023255,43.225369
2020-108379,2020-09-14,000001,Vente,174480,2,,RUE DE LA GRAVE,0021,11150,11418,Villasavary,11,,,114180000D1977,,,,,,,,,,,,,0,3,Dépendance,,0,S,sols,,,1010,2.041956,43.219444
2020-108379,2020-09-14,000001,Vente,174480,2,,RUE DE LA GRAVE,0021,11150,11418,Villasavary,11,,,114180000D1977,,,,,,,,,,,,,0,1,Maison,90,4,S,sols,,,1010,2.041956,43.219444
2020-108424,2020-09-29,000001,Vente,80000,182,,RUE LOUIS OURNAC,0172,11150,11418,Villasavary,11,,,114180000D1817,,,,,,,,,,,,,0,1,Maison,90,3,S,sols,,,1049,2.041505,43.219278
2020-109116,2020-10-30,000001,Vente,150000,,,LE VILLAGE,B155,11150,11418,Villasavary,11,,,114180000D0432,,,,,,,,,,,,,0,,,,,S,sols,,,54,2.039525,43.219921
2020-109116,2020-10-30,000001,Vente,150000,40,,RUE DU BARRY,0009,11150,11418,Villasavary,11,,,114180000D0433,,,,,,,,,,,,,0,1,Maison,260,7,S,sols,,,670,2.039518,43.219775
2020-109444,2020-11-09,000001,Vente,82500,120,,LE VILLAGE,B155,11150,11418,Villasavary,11,,,114180000D0268,,,,,,,,,,,,,0,1,Maison,99,5,S,sols,,,127,2.03797,43.221781
2020-109542,2020-11-26,000002,Vente,140000,311,,MILLASSET,B079,11150,11418,Villasavary,11,,,11418000ZD0071,,,,,,,,,,,,,0,1,Maison,130,6,,,,,,2.065954,43.250352
2020-110023,2020-12-21,000001,Vente,366360.66,,,LE VILLAGE,B155,11150,11418,Villasavary,11,,,114180000D0518,,,,,,,,,,,,,0,,,,,BT,taillis simples,,,770,2.036379,43.221767
2020-110023,2020-12-21,000001,Vente,366360.66,6,A,RUE DU BARRY,0009,11150,11418,Villasavary,11,,,114180000D1952,,,,,,,,,,,,,0,1,Maison,140,5,T,terres,,,2140,2.036898,43.221563
2020-110023,2020-12-21,000001,Vente,366360.66,6,A,RUE DU BARRY,0009,11150,11418,Villasavary,11,,,114180000D1952,,,,,,,,,,,,,0,4,Local industriel. commercial ou assimilé,14,0,T,terres,,,2140,2.036898,43.221563
2020-110023,2020-12-21,000001,Vente,366360.66,,,LE VILLAGE,B155,11150,11418,Villasavary,11,,,114180000D1953,,,,,,,,,,,,,0,,,,,BT,taillis simples,,,800,2.036387,43.221481
2020-110153,2020-12-15,000001,Vente,116800,9001,,RUE ENGABELLE,0017,11150,11418,Villasavary,11,,,114180000D0164,,,,,,,,,,,,,0,1,Maison,98,5,S,sols,,,38,2.040467,43.221244
2020-110153,2020-12-15,000001,Vente,116800,,,LE VILLAGE,B155,11150,11418,Villasavary,11,,,114180000D1473,,,,,,,,,,,,,0,,,,,S,sols,,,33,2.040407,43.221258
2020-110153,2020-12-15,000001,Vente,116800,,,LE VILLAGE,B155,11150,11418,Villasavary,11,,,114180000D1748,,,,,,,,,,,,,0,,,,,S,sols,,,71,2.04035,43.221259
2020-110277,2020-12-30,000001,Vente,3000,,,LE VILLAGE,B155,11150,11418,Villasavary,11,,,114180000D0515,,,,,,,,,,,,,0,,,,,J,jardins,POTAG,Jardin potager,1500,2.036061,43.221446
2020-110308,2020-12-22,000002,Vente,122000,,,ENSERNIN,B042,11150,11418,Villasavary,11,,,11418000ZT0012,,,,,,,,,,,,,0,,,,,T,terres,,,25560,2.051127,43.204521
2020-110308,2020-12-22,000002,Vente,122000,,,ENSERNIN,B042,11150,11418,Villasavary,11,,,11418000ZT0012,,,,,,,,,,,,,0,,,,,T,terres,,,25560,2.051127,43.204521
2020-110308,2020-12-22,000002,Vente,122000,,,SALSET,B134,11150,11418,Villasavary,11,,,11418000ZU0068,,,,,,,,,,,,,0,,,,,T,terres,,,10005,2.049284,43.201655
2020-110308,2020-12-22,000002,Vente,122000,,,SALSET,B134,11150,11418,Villasavary,11,,,11418000ZU0070,,,,,,,,,,,,,0,,,,,T,terres,,,7554,2.048192,43.20274
2020-110308,2020-12-22,000002,Vente,122000,,,SALSET,B134,11150,11418,Villasavary,11,,,11418000ZU0070,,,,,,,,,,,,,0,,,,,T,terres,,,15110,2.048192,43.20274
2020-110334,2020-12-17,000001,Vente,186250,5027,,RUE ENGABELLE,0017,11150,11418,Villasavary,11,,,114180000D0114,,,,,,,,,,,,,0,1,Maison,104,5,S,sols,,,210,2.039181,43.221901
2020-110334,2020-12-17,000001,Vente,186250,,,LE VILLAGE,B155,11150,11418,Villasavary,11,,,114180000D1460,,,,,,,,,,,,,0,,,,,S,sols,,,290,2.039029,43.222182
2020-110334,2020-12-17,000001,Vente,186250,,,LE VILLAGE,B155,11150,11418,Villasavary,11,,,114180000D1461,,,,,,,,,,,,,0,,,,,J,jardins,POTAG,Jardin potager,126,2.039212,43.222196
