id_mutation,date_mutation,numero_disposition,nature_mutation,valeur_fonciere,adresse_numero,adresse_suffixe,adresse_nom_voie,adresse_code_voie,code_postal,code_commune,nom_commune,code_departement,ancien_code_commune,ancien_nom_commune,id_parcelle,ancien_id_parcelle,numero_volume,lot1_numero,lot1_surface_carrez,lot2_numero,lot2_surface_carrez,lot3_numero,lot3_surface_carrez,lot4_numero,lot4_surface_carrez,lot5_numero,lot5_surface_carrez,nombre_lots,code_type_local,type_local,surface_reelle_bati,nombre_pieces_principales,code_nature_culture,nature_culture,code_nature_culture_speciale,nature_culture_speciale,surface_terrain,longitude,latitude
2020-121964,2020-12-22,000002,Vente,1792,,,TRESCOL,B085,12350,12091,Drulhe,12,,,120910000D1553,,,,,,,,,,,,,0,,,,,T,terres,,,2135,2.135055,44.433931
2020-121964,2020-12-22,000002,Vente,1792,,,TRESCOL,B085,12350,12091,Drulhe,12,,,120910000D1556,,,,,,,,,,,,,0,,,,,P,prés,,,852,2.134598,44.433925
2020-123749,2020-01-28,000001,Vente,60000,,,DRULHE,B035,12350,12091,Drulhe,12,,,120910000A0901,,,,,,,,,,,,,0,,,,,J,jardins,,,275,2.128759,44.461596
2020-123749,2020-01-28,000001,Vente,60000,5020,A,DRULHE,B035,12350,12091,Drulhe,12,,,120910000A1475,,,,,,,,,,,,,0,4,Local industriel. commercial ou assimilé,295,0,S,sols,,,1016,2.128915,44.461666
2020-123896,2020-01-30,000001,Vente,11000,,,LE COLOMBIE,B026,12350,12091,Drulhe,12,,,120910000A0944,,,,,,,,,,,,,0,,,,,T,terres,,,1275,2.129977,44.462906
2020-124290,2020-05-28,000001,Vente,20,,,L ESTURGUIE,B038,12350,12091,Drulhe,12,,,120910000D0833,,,,,,,,,,,,,0,,,,,S,sols,,,42,2.130802,44.436914
2020-124458,2020-06-30,000001,Vente,7985,,,LA BLAQUIERE,B006,12350,12091,Drulhe,12,,,120910000D1018,,,,,,,,,,,,,0,,,,,P,prés,,,9394,2.126228,44.44368
2020-124474,2020-06-30,000002,Vente,13600,,,LA RIALE,B077,12350,12091,Drulhe,12,,,120910000A1254,,,,,,,,,,,,,0,,,,,T,terres,,,5715,2.128429,44.456032
2020-124512,2020-07-17,000001,Vente,160000,,,L ESTURGUIE,B038,12350,12091,Drulhe,12,,,120910000D0842,,,,,,,,,,,,,0,,,,,J,jardins,,,355,2.131486,44.438154
2020-124512,2020-07-17,000001,Vente,160000,,,L ESTURGUIE,B038,12350,12091,Drulhe,12,,,120910000D0963,,,,,,,,,,,,,0,,,,,P,prés,,,24,2.131851,44.438337
2020-124512,2020-07-17,000001,Vente,160000,5116,,L ESTURGUIE,B038,12350,12091,Drulhe,12,,,120910000D0966,,,,,,,,,,,,,0,1,Maison,130,6,S,sols,,,764,2.131608,44.438297
2020-124512,2020-07-17,000001,Vente,160000,5116,,L ESTURGUIE,B038,12350,12091,Drulhe,12,,,120910000D0966,,,,,,,,,,,,,0,3,Dépendance,,0,S,sols,,,764,2.131608,44.438297
2020-124512,2020-07-17,000001,Vente,160000,5116,,L ESTURGUIE,B038,12350,12091,Drulhe,12,,,120910000D0966,,,,,,,,,,,,,0,3,Dépendance,,0,S,sols,,,764,2.131608,44.438297
2020-124512,2020-07-17,000001,Vente,160000,,,L ESTURGUIE,B038,12350,12091,Drulhe,12,,,120910000D0967,,,,,,,,,,,,,0,,,,,T,terres,,,418,2.131568,44.437999
2020-124512,2020-07-17,000001,Vente,160000,,,L ESTURGUIE,B038,12350,12091,Drulhe,12,,,120910000D0967,,,,,,,,,,,,,0,,,,,T,terres,,,1254,2.131568,44.437999
2020-124512,2020-07-17,000001,Vente,160000,,,L ESTURGUIE,B038,12350,12091,Drulhe,12,,,120910000D1402,,,,,,,,,,,,,0,,,,,T,terres,,,195,2.131603,44.438395
2020-124531,2020-07-15,000001,Vente,117000,,,LA BERNARDERIE,B004,12350,12091,Drulhe,12,,,120910000C0309,,,,,,,,,,,,,0,,,,,S,sols,,,560,2.144997,44.441346
2020-124531,2020-07-15,000001,Vente,117000,,,LA BERNARDERIE,B004,12350,12091,Drulhe,12,,,120910000C0309,,,,,,,,,,,,,0,,,,,P,prés,,,15700,2.144997,44.441346
2020-124531,2020-07-15,000001,Vente,117000,,,LA BERNARDERIE,B004,12350,12091,Drulhe,12,,,120910000C0310,,,,,,,,,,,,,0,,,,,S,sols,,,355,2.145799,44.440676
2020-124531,2020-07-15,000001,Vente,117000,5100,,LA BERNARDERIE,B004,12350,12091,Drulhe,12,,,120910000C0311,,,,,,,,,,,,,0,1,Maison,180,7,S,sols,,,1195,2.146058,44.440737
2020-124594,2020-07-31,000001,Vente,110000,3,,ALL DES CHENES,0030,12350,12091,Drulhe,12,,,120910000A1412,,,,,,,,,,,,,0,1,Maison,95,4,S,sols,,,700,2.132484,44.457201
2020-124725,2020-09-21,000002,Vente,100000,,,MORLHONIE,B058,12350,12091,Drulhe,12,,,120910000D1515,,,,,,,,,,,,,0,,,,,J,jardins,,,39,2.126461,44.429916
2020-124725,2020-09-21,000002,Vente,100000,5113,,MORLHONIE,B058,12350,12091,Drulhe,12,,,120910000D1517,,,,,,,,,,,,,0,1,Maison,60,2,,,,,,2.12644,44.430241
2020-124725,2020-09-21,000002,Vente,100000,5113,,MORLHONIE,B058,12350,12091,Drulhe,12,,,120910000D1517,,,,,,,,,,,,,0,1,Maison,139,4,,,,,,2.12644,44.430241
