id_mutation,date_mutation,numero_disposition,nature_mutation,valeur_fonciere,adresse_numero,adresse_suffixe,adresse_nom_voie,adresse_code_voie,code_postal,code_commune,nom_commune,code_departement,ancien_code_commune,ancien_nom_commune,id_parcelle,ancien_id_parcelle,numero_volume,lot1_numero,lot1_surface_carrez,lot2_numero,lot2_surface_carrez,lot3_numero,lot3_surface_carrez,lot4_numero,lot4_surface_carrez,lot5_numero,lot5_surface_carrez,nombre_lots,code_type_local,type_local,surface_reelle_bati,nombre_pieces_principales,code_nature_culture,nature_culture,code_nature_culture_speciale,nature_culture_speciale,surface_terrain,longitude,latitude
2020-120638,2020-10-29,000001,Vente,16072,,,SAINT PARTHEM,B070,12300,12240,Saint-Parthem,12,,,122400000A1981,,,,,,,,,,,,,0,,,,,T,terres,,,840,2.312676,44.627663
2020-120638,2020-10-29,000001,Vente,16072,,,SAINT PARTHEM,B070,12300,12240,Saint-Parthem,12,,,122400000A1985,,,,,,,,,,,,,0,,,,,T,terres,,,96,2.312459,44.627554
2020-120638,2020-10-29,000001,Vente,16072,,,SAINT PARTHEM,B070,12300,12240,Saint-Parthem,12,,,122400000A1996,,,,,,,,,,,,,0,,,,,T,terres,,,297,2.312817,44.62756
2020-120638,2020-10-29,000001,Vente,16072,,,SAINT PARTHEM,B070,12300,12240,Saint-Parthem,12,,,122400000A1998,,,,,,,,,,,,,0,,,,,T,terres,,,151,2.312862,44.627473
2020-120708,2020-11-13,000001,Vente,52000,5017,,LE BOURG,B081,12300,12240,Saint-Parthem,12,,,122400000A1693,,,,,,,,,,,,,0,1,Maison,75,3,T,terres,,,423,2.315466,44.625868
2020-120708,2020-11-13,000001,Vente,52000,5017,,LE BOURG,B081,12300,12240,Saint-Parthem,12,,,122400000A1693,,,,,,,,,,,,,0,1,Maison,75,3,S,sols,,,194,2.315466,44.625868
2020-120708,2020-11-13,000001,Vente,52000,,,SAINT PARTHEM,B070,12300,12240,Saint-Parthem,12,,,122400000A2022,,,,,,,,,,,,,0,,,,,S,sols,,,111,2.315627,44.626175
2020-120708,2020-11-13,000001,Vente,52000,,,SAINT PARTHEM,B070,12300,12240,Saint-Parthem,12,,,122400000A2023,,,,,,,,,,,,,0,,,,,S,sols,,,28,2.315713,44.626118
2020-120708,2020-11-13,000001,Vente,52000,5016,,LE BOURG,B081,12300,12240,Saint-Parthem,12,,,122400000A2024,,,,,,,,,,,,,0,3,Dépendance,,0,S,sols,,,65,2.315704,44.626126
2020-120708,2020-11-13,000001,Vente,52000,,,SAINT PARTHEM,B070,12300,12240,Saint-Parthem,12,,,122400000A2025,,,,,,,,,,,,,0,,,,,S,sols,,,51,2.315862,44.626096
2020-121196,2020-12-03,000001,Vente,754.5,,,SAINT PARTHEM,B070,12300,12240,Saint-Parthem,12,,,122400000A2028,,,,,,,,,,,,,0,,,,,L,landes,,,264,2.311701,44.627638
2020-121196,2020-12-03,000001,Vente,754.5,,,SAINT PARTHEM,B070,12300,12240,Saint-Parthem,12,,,122400000A2029,,,,,,,,,,,,,0,,,,,L,landes,,,239,2.311886,44.62781
2020-121198,2020-11-18,000002,Vente,1500,,,LE GARRIGOL,B029,12300,12240,Saint-Parthem,12,,,122400000D1116,,,,,,,,,,,,,0,,,,,AB,terrains a bâtir,,,1135,,
2020-121200,2020-11-12,000001,Vente,1,,,AGRES,B001,12300,12240,Saint-Parthem,12,,,122400000D1571,,,,,,,,,,,,,0,,,,,P,prés,,,327,2.260648,44.618085
2020-121590,2020-12-16,000001,Vente,45000,5323,,PORT D AGRES,B049,12300,12240,Saint-Parthem,12,,,122400000D1389,,,,,,,,,,,,,0,4,Local industriel. commercial ou assimilé,250,0,S,sols,,,1587,2.253747,44.613823
2020-122103,2020-12-22,000002,Vente,8002,,,LES PEYROUSES,B047,12300,12240,Saint-Parthem,12,,,122400000A0635,,,,,,,,,,,,,0,,,,,BS,taillis sous futaie,,,1509,2.308155,44.632897
2020-122103,2020-12-22,000002,Vente,8002,,,LES PEYROUSES,B047,12300,12240,Saint-Parthem,12,,,122400000A0707,,,,,,,,,,,,,0,,,,,BT,taillis simples,,,1589,2.308547,44.633299
2020-122103,2020-12-22,000002,Vente,8002,,,LES PEYROUSES,B047,12300,12240,Saint-Parthem,12,,,122400000A0708,,,,,,,,,,,,,0,,,,,BT,taillis simples,,,874,2.308896,44.633582
2020-122103,2020-12-22,000002,Vente,8002,,,SAINT PARTHEM,B070,12300,12240,Saint-Parthem,12,,,122400000A0888,,,,,,,,,,,,,0,,,,,T,terres,,,240,2.320663,44.626489
2020-122103,2020-12-22,000002,Vente,8002,,,SAINT PARTHEM,B070,12300,12240,Saint-Parthem,12,,,122400000A0988,,,,,,,,,,,,,0,,,,,T,terres,,,792,2.318907,44.62775
2020-122103,2020-12-22,000002,Vente,8002,,,SAINT PARTHEM,B070,12300,12240,Saint-Parthem,12,,,122400000A0989,,,,,,,,,,,,,0,,,,,T,terres,,,1249,2.319292,44.627999
2020-122103,2020-12-22,000002,Vente,8002,,,SAINT PARTHEM,B070,12300,12240,Saint-Parthem,12,,,122400000A0990,,,,,,,,,,,,,0,,,,,VI,vignes,,,1022,2.318789,44.628102
2020-122103,2020-12-22,000002,Vente,8002,,,SAINT PARTHEM,B070,12300,12240,Saint-Parthem,12,,,122400000A1216,,,,,,,,,,,,,0,,,,,P,prés,,,2203,2.31052,44.626894
2020-122103,2020-12-22,000002,Vente,8002,,,SAINT PARTHEM,B070,12300,12240,Saint-Parthem,12,,,122400000A1625,,,,,,,,,,,,,0,,,,,T,terres,,,209,2.316701,44.625017
2020-122174,2020-12-31,000001,Vente,175815,,,SAINT PARTHEM,B070,12300,12240,Saint-Parthem,12,,,122400000A0871,,,,,,,,,,,,,0,,,,,L,landes,,,290,2.319836,44.628158
2020-122174,2020-12-31,000001,Vente,175815,,,SAINT PARTHEM,B070,12300,12240,Saint-Parthem,12,,,122400000A0872,,,,,,,,,,,,,0,,,,,L,landes,,,202,2.319834,44.628027
2020-122174,2020-12-31,000001,Vente,175815,,,SAINT PARTHEM,B070,12300,12240,Saint-Parthem,12,,,122400000A0873,,,,,,,,,,,,,0,,,,,L,landes,,,84,2.319715,44.627996
2020-122174,2020-12-31,000001,Vente,175815,,,SAINT PARTHEM,B070,12300,12240,Saint-Parthem,12,,,122400000A0874,,,,,,,,,,,,,0,,,,,L,landes,,,25,2.319662,44.627971
2020-122174,2020-12-31,000001,Vente,175815,5012,,LE BOURG,B081,12300,12240,Saint-Parthem,12,,,122400000A0875,,,,,,,,,,,,,0,1,Maison,150,3,L,landes,PATUR,Pâture plantée,946,2.320144,44.627577
2020-122174,2020-12-31,000001,Vente,175815,5012,,LE BOURG,B081,12300,12240,Saint-Parthem,12,,,122400000A0875,,,,,,,,,,,,,0,3,Dépendance,,0,L,landes,PATUR,Pâture plantée,946,2.320144,44.627577
2020-122174,2020-12-31,000001,Vente,175815,5012,,LE BOURG,B081,12300,12240,Saint-Parthem,12,,,122400000A0875,,,,,,,,,,,,,0,1,Maison,150,3,S,sols,,,370,2.320144,44.627577
2020-122174,2020-12-31,000001,Vente,175815,5012,,LE BOURG,B081,12300,12240,Saint-Parthem,12,,,122400000A0875,,,,,,,,,,,,,0,3,Dépendance,,0,S,sols,,,370,2.320144,44.627577
2020-122174,2020-12-31,000001,Vente,175815,,,SAINT PARTHEM,B070,12300,12240,Saint-Parthem,12,,,122400000A0876,,,,,,,,,,,,,0,,,,,L,landes,PATUR,Pâture plantée,686,2.320096,44.627845
2020-122174,2020-12-31,000001,Vente,175815,,,SAINT PARTHEM,B070,12300,12240,Saint-Parthem,12,,,122400000A0876,,,,,,,,,,,,,0,,,,,S,sols,,,504,2.320096,44.627845
2020-122174,2020-12-31,000001,Vente,175815,,,SAINT PARTHEM,B070,12300,12240,Saint-Parthem,12,,,122400000A0877,,,,,,,,,,,,,0,,,,,L,landes,PATUR,Pâture plantée,681,2.320586,44.627544
2020-122174,2020-12-31,000001,Vente,175815,,,SAINT PARTHEM,B070,12300,12240,Saint-Parthem,12,,,122400000A0878,,,,,,,,,,,,,0,,,,,L,landes,PATUR,Pâture plantée,1964,2.320456,44.627873
2020-122174,2020-12-31,000001,Vente,175815,,,SAINT PARTHEM,B070,12300,12240,Saint-Parthem,12,,,122400000A0878,,,,,,,,,,,,,0,,,,,S,sols,,,50,2.320456,44.627873
2020-122174,2020-12-31,000001,Vente,175815,,,SAINT PARTHEM,B070,12300,12240,Saint-Parthem,12,,,122400000A1346,,,,,,,,,,,,,0,,,,,L,landes,PATUR,Pâture plantée,1399,2.319792,44.627566
2020-122174,2020-12-31,000001,Vente,175815,,,SAINT PARTHEM,B070,12300,12240,Saint-Parthem,12,,,122400000A1348,,,,,,,,,,,,,0,,,,,L,landes,PATUR,Pâture plantée,11,2.319529,44.627666
2020-122174,2020-12-31,000001,Vente,175815,,,SAINT PARTHEM,B070,12300,12240,Saint-Parthem,12,,,122400000A1671,,,,,,,,,,,,,0,,,,,L,landes,PATUR,Pâture plantée,94,2.320762,44.627624
2020-123761,2020-01-21,000001,Vente,3400,,,SAINT PARTHEM,B070,12300,12240,Saint-Parthem,12,,,122400000A0884,,,,,,,,,,,,,0,,,,,T,terres,,,240,2.320666,44.626582
2020-123761,2020-01-21,000001,Vente,3400,,,SAINT PARTHEM,B070,12300,12240,Saint-Parthem,12,,,122400000A0892,,,,,,,,,,,,,0,,,,,P,prés,,,164,2.320921,44.626161
2020-123761,2020-01-21,000001,Vente,3400,,,SAINT PARTHEM,B070,12300,12240,Saint-Parthem,12,,,122400000A0893,,,,,,,,,,,,,0,,,,,T,terres,,,376,2.320524,44.626279
2020-123761,2020-01-21,000001,Vente,3400,,,SAINT PARTHEM,B070,12300,12240,Saint-Parthem,12,,,122400000A0903,,,,,,,,,,,,,0,,,,,T,terres,,,2586,2.319394,44.625275
2020-123761,2020-01-21,000001,Vente,3400,,,SAINT PARTHEM,B070,12300,12240,Saint-Parthem,12,,,122400000A1543,,,,,,,,,,,,,0,,,,,P,prés,,,412,2.318163,44.62649
2020-123761,2020-01-21,000001,Vente,3400,,,SAINT PARTHEM,B070,12300,12240,Saint-Parthem,12,,,122400000A1765,,,,,,,,,,,,,0,,,,,T,terres,,,987,2.316151,44.624228
2020-123911,2020-02-26,000002,Vente,170000,,,AGRES,B001,12300,12240,Saint-Parthem,12,,,122400000D0670,,,,,,,,,,,,,0,,,,,J,jardins,,,468,2.26019,44.618075
2020-123911,2020-02-26,000002,Vente,170000,5100,,AGRES,B001,12300,12240,Saint-Parthem,12,,,122400000D0671,,,,,,,,,,,,,0,1,Maison,88,4,S,sols,,,299,2.260176,44.618179
2020-123911,2020-02-26,000002,Vente,170000,,,AGRES,B001,12300,12240,Saint-Parthem,12,,,122400000D1570,,,,,,,,,,,,,0,,,,,P,prés,,,1046,2.260516,44.618081
2020-123971,2020-02-20,000001,Vente,8480,,,SAINT PARTHEM,B070,12300,12240,Saint-Parthem,12,,,122400000A2009,,,,,,,,,,,,,0,,,,,T,terres,,,520,2.313411,44.627354
2020-123971,2020-02-20,000001,Vente,8480,,,SAINT PARTHEM,B070,12300,12240,Saint-Parthem,12,,,122400000A2010,,,,,,,,,,,,,0,,,,,T,terres,,,435,2.313653,44.627407
2020-124030,2020-03-16,000001,Vente,75000,,,LA RENDIE,B059,12300,12240,Saint-Parthem,12,,,122400000A0118,,,,,,,,,,,,,0,,,,,S,sols,,,41,2.322801,44.639574
2020-124030,2020-03-16,000001,Vente,75000,5247,,LA RENDIE,B059,12300,12240,Saint-Parthem,12,,,122400000A0120,,,,,,,,,,,,,0,1,Maison,75,4,S,sols,,,197,2.322596,44.639529
2020-124030,2020-03-16,000001,Vente,75000,,,LA RENDIE,B059,12300,12240,Saint-Parthem,12,,,122400000A0142,,,,,,,,,,,,,0,,,,,L,landes,PATUR,Pâture plantée,551,2.322299,44.639601
2020-124030,2020-03-16,000001,Vente,75000,,,LA RENDIE,B059,12300,12240,Saint-Parthem,12,,,122400000A0145,,,,,,,,,,,,,0,,,,,J,jardins,,,358,2.321806,44.639522
2020-124030,2020-03-16,000001,Vente,75000,,,LA RENDIE,B059,12300,12240,Saint-Parthem,12,,,122400000A0148,,,,,,,,,,,,,0,,,,,S,sols,,,13,2.322091,44.639687
2020-124158,2020-05-22,000001,Vente,65000,,,LA BASTAYRIE,B005,12300,12240,Saint-Parthem,12,,,122400000D1437,,,,,,,,,,,,,0,,,,,P,prés,,,67,2.252717,44.614775
2020-124158,2020-05-22,000001,Vente,65000,,,LA BASTAYRIE,B005,12300,12240,Saint-Parthem,12,,,122400000D1439,,,,,,,,,,,,,0,,,,,L,landes,PATUR,Pâture plantée,149,2.252758,44.614741
2020-124158,2020-05-22,000001,Vente,65000,5147,,PORT D AGRES,B049,12300,12240,Saint-Parthem,12,,,122400000D1440,,,,,,,,,,,,,0,1,Maison,70,3,S,sols,,,102,2.252834,44.614767
2020-124451,2020-07-03,000001,Vente,4500,,,SAINT PARTHEM,B070,12300,12240,Saint-Parthem,12,,,122400000A2005,,,,,,,,,,,,,0,,,,,L,landes,PATUR,Pâture plantée,278,2.314611,44.627474
2020-124451,2020-07-03,000001,Vente,4500,,,SAINT PARTHEM,B070,12300,12240,Saint-Parthem,12,,,122400000A2013,,,,,,,,,,,,,0,,,,,T,terres,,,1040,2.31477,44.627382
2020-124452,2020-07-03,000001,Vente,10000,,,SAINT PARTHEM,B070,12300,12240,Saint-Parthem,12,,,122400000A1469,,,,,,,,,,,,,0,,,,,T,terres,,,177,2.312173,44.627332
2020-124452,2020-07-03,000001,Vente,10000,,,SAINT PARTHEM,B070,12300,12240,Saint-Parthem,12,,,122400000A1474,,,,,,,,,,,,,0,,,,,T,terres,,,112,2.312377,44.627297
2020-124452,2020-07-03,000001,Vente,10000,,,SAINT PARTHEM,B070,12300,12240,Saint-Parthem,12,,,122400000A1983,,,,,,,,,,,,,0,,,,,T,terres,,,176,2.312488,44.627345
2020-124452,2020-07-03,000001,Vente,10000,,,SAINT PARTHEM,B070,12300,12240,Saint-Parthem,12,,,122400000A1987,,,,,,,,,,,,,0,,,,,T,terres,,,391,2.312324,44.627409
2020-124452,2020-07-03,000001,Vente,10000,,,SAINT PARTHEM,B070,12300,12240,Saint-Parthem,12,,,122400000A1992,,,,,,,,,,,,,0,,,,,L,landes,,,188,2.312129,44.627451
2020-124452,2020-07-03,000001,Vente,10000,,,SAINT PARTHEM,B070,12300,12240,Saint-Parthem,12,,,122400000A1995,,,,,,,,,,,,,0,,,,,T,terres,,,716,2.311913,44.62748
2020-124766,2020-09-17,000001,Vente,13580,,,LA BESSE,B007,12300,12240,Saint-Parthem,12,,,122400000B0113,,,,,,,,,,,,,0,,,,,L,landes,PATUR,Pâture plantée,3310,2.328046,44.630544
2020-124766,2020-09-17,000001,Vente,13580,,,LA BESSE,B007,12300,12240,Saint-Parthem,12,,,122400000B0114,,,,,,,,,,,,,0,,,,,BT,taillis simples,,,1013,2.328622,44.6311
2020-124766,2020-09-17,000001,Vente,13580,,,LA BESSE,B007,12300,12240,Saint-Parthem,12,,,122400000B0115,,,,,,,,,,,,,0,,,,,BT,taillis simples,,,507,2.328889,44.631342
2020-124766,2020-09-17,000001,Vente,13580,,,LA BESSE,B007,12300,12240,Saint-Parthem,12,,,122400000B0116,,,,,,,,,,,,,0,,,,,BT,taillis simples,,,3190,2.329447,44.631806
2020-124766,2020-09-17,000001,Vente,13580,,,LA BESSE,B007,12300,12240,Saint-Parthem,12,,,122400000B0117,,,,,,,,,,,,,0,,,,,BT,taillis simples,,,1993,2.329539,44.63201
2020-124766,2020-09-17,000001,Vente,13580,,,LA BESSE,B007,12300,12240,Saint-Parthem,12,,,122400000B0118,,,,,,,,,,,,,0,,,,,BT,taillis simples,,,957,2.329969,44.632142
2020-124766,2020-09-17,000001,Vente,13580,,,LA BESSE,B007,12300,12240,Saint-Parthem,12,,,122400000B0132,,,,,,,,,,,,,0,,,,,L,landes,PATUR,Pâture plantée,12935,2.332653,44.628224
2020-124766,2020-09-17,000001,Vente,13580,,,LA BESSE,B007,12300,12240,Saint-Parthem,12,,,122400000B0134,,,,,,,,,,,,,0,,,,,L,landes,PATUR,Pâture plantée,1561,2.331444,44.628292
2020-124766,2020-09-17,000001,Vente,13580,,,LA BESSE,B007,12300,12240,Saint-Parthem,12,,,122400000B0135,,,,,,,,,,,,,0,,,,,T,terres,,,13206,2.331222,44.627364
2020-124766,2020-09-17,000001,Vente,13580,,,LA BESSE,B007,12300,12240,Saint-Parthem,12,,,122400000B0142,,,,,,,,,,,,,0,,,,,L,landes,PATUR,Pâture plantée,9350,2.334956,44.627599
2020-124766,2020-09-17,000001,Vente,13580,,,LA BESSE,B007,12300,12240,Saint-Parthem,12,,,122400000B0148,,,,,,,,,,,,,0,,,,,T,terres,,,2800,2.331976,44.625215
2020-124766,2020-09-17,000001,Vente,13580,,,LA BESSE,B007,12300,12240,Saint-Parthem,12,,,122400000B0170,,,,,,,,,,,,,0,,,,,T,terres,,,16815,2.3284,44.627069
2020-124766,2020-09-17,000001,Vente,13580,,,LA BESSE,B007,12300,12240,Saint-Parthem,12,,,122400000B0175,,,,,,,,,,,,,0,,,,,T,terres,,,5242,2.330884,44.623612
2020-124766,2020-09-17,000001,Vente,13580,,,LA BESSE,B007,12300,12240,Saint-Parthem,12,,,122400000B0175,,,,,,,,,,,,,0,,,,,T,terres,,,5243,2.330884,44.623612
2020-124766,2020-09-17,000001,Vente,13580,,,LA BESSE,B007,12300,12240,Saint-Parthem,12,,,122400000B0176,,,,,,,,,,,,,0,,,,,VE,vergers,CHAT,Châtaigneraie,4155,2.331175,44.622887
2020-124766,2020-09-17,000001,Vente,13580,,,LA BESSE,B007,12300,12240,Saint-Parthem,12,,,122400000B0177,,,,,,,,,,,,,0,,,,,L,landes,PATUR,Pâture plantée,18320,2.329605,44.623155
2020-124766,2020-09-17,000001,Vente,13580,,,LA BESSE,B007,12300,12240,Saint-Parthem,12,,,122400000B0199,,,,,,,,,,,,,0,,,,,BT,taillis simples,,,682,2.324544,44.624185
2020-124766,2020-09-17,000001,Vente,13580,,,LA BESSE,B007,12300,12240,Saint-Parthem,12,,,122400000B0209,,,,,,,,,,,,,0,,,,,L,landes,PATUR,Pâture plantée,7667,2.326887,44.625531
2020-124766,2020-09-17,000001,Vente,13580,,,LA BESSE,B007,12300,12240,Saint-Parthem,12,,,122400000B0210,,,,,,,,,,,,,0,,,,,L,landes,PATUR,Pâture plantée,1621,2.327037,44.625388
2020-124766,2020-09-17,000001,Vente,13580,,,LA BESSE,B007,12300,12240,Saint-Parthem,12,,,122400000B0211,,,,,,,,,,,,,0,,,,,L,landes,PATUR,Pâture plantée,372,2.327503,44.625451
2020-124766,2020-09-17,000001,Vente,13580,,,LA BESSE,B007,12300,12240,Saint-Parthem,12,,,122400000B0215,,,,,,,,,,,,,0,,,,,BT,taillis simples,,,1107,2.324066,44.624701
2020-124766,2020-09-17,000001,Vente,13580,,,LE BOIS GRAND,B010,12300,12240,Saint-Parthem,12,,,122400000B0246,,,,,,,,,,,,,0,,,,,L,landes,,,4881,2.324112,44.623959
2020-124766,2020-09-17,000001,Vente,13580,,,LA ROMIGUIERE,B066,12300,12240,Saint-Parthem,12,,,122400000B0270,,,,,,,,,,,,,0,,,,,BT,taillis simples,,,2540,2.331718,44.620399
2020-124768,2020-09-30,000001,Vente,1111000,,,LE SERIEYSSOL,B073,12300,12240,Saint-Parthem,12,,,122400000D1060,,,,,,,,,,,,,0,,,,,L,landes,PATUR,Pâture plantée,150,2.256139,44.641299
2020-124768,2020-09-30,000001,Vente,1111000,,,LE SERIEYSSOL,B073,12300,12240,Saint-Parthem,12,,,122400000D1065,,,,,,,,,,,,,0,,,,,L,landes,PATUR,Pâture plantée,172,2.256103,44.641353
2020-124768,2020-09-30,000001,Vente,1111000,5323,,PORT D AGRES,B049,12300,12240,Saint-Parthem,12,,,122400000D1389,,,,,,,,,,,,,0,4,Local industriel. commercial ou assimilé,250,0,S,sols,,,1587,2.253747,44.613823
2020-124768,2020-09-30,000001,Vente,1111000,,,LE SERIEYSSOL,B073,12300,12240,Saint-Parthem,12,,,12240000ZA0001,,,,,,,,,,,,,0,,,,,T,terres,,,16993,2.257308,44.644933
2020-124768,2020-09-30,000001,Vente,1111000,,,LE VERGNAS,B078,12300,12240,Saint-Parthem,12,,,12240000ZA0003,,,,,,,,,,,,,0,,,,,T,terres,,,33000,2.259173,44.646161
2020-124768,2020-09-30,000001,Vente,1111000,,,LE VERGNAS,B078,12300,12240,Saint-Parthem,12,,,12240000ZA0003,,,,,,,,,,,,,0,,,,,VE,vergers,CHAT,Châtaigneraie,3000,2.259173,44.646161
2020-124768,2020-09-30,000001,Vente,1111000,,,LE VERGNAS,B078,12300,12240,Saint-Parthem,12,,,12240000ZA0003,,,,,,,,,,,,,0,,,,,BS,taillis sous futaie,,,4757,2.259173,44.646161
2020-124823,2020-09-23,000001,Vente,42500,5107,,AGRES,B001,12300,12240,Saint-Parthem,12,,,122400000D0695,,,,,,,,,,,,,0,1,Maison,60,4,S,sols,,,269,2.259874,44.617493
2020-124823,2020-09-23,000001,Vente,42500,,,AGRES,B001,12300,12240,Saint-Parthem,12,,,122400000D1204,,,,,,,,,,,,,0,,,,,T,terres,,,2243,2.261054,44.617456
