id_mutation,date_mutation,numero_disposition,nature_mutation,valeur_fonciere,adresse_numero,adresse_suffixe,adresse_nom_voie,adresse_code_voie,code_postal,code_commune,nom_commune,code_departement,ancien_code_commune,ancien_nom_commune,id_parcelle,ancien_id_parcelle,numero_volume,lot1_numero,lot1_surface_carrez,lot2_numero,lot2_surface_carrez,lot3_numero,lot3_surface_carrez,lot4_numero,lot4_surface_carrez,lot5_numero,lot5_surface_carrez,nombre_lots,code_type_local,type_local,surface_reelle_bati,nombre_pieces_principales,code_nature_culture,nature_culture,code_nature_culture_speciale,nature_culture_speciale,surface_terrain,longitude,latitude
2020-181191,2020-01-11,000001,Vente,140000,5050,,LA CROIX D HEULAND,B084,14430,14329,Heuland,14,,,143290000A0267,,,,,,,,,,,,,0,1,Maison,99,6,AG,terrains d'agrément,,,510,-0.000751,49.279
2020-181191,2020-01-11,000001,Vente,140000,5050,,LA CROIX D HEULAND,B084,14430,14329,Heuland,14,,,143290000A0267,,,,,,,,,,,,,0,1,Maison,99,6,S,sols,,,500,-0.000751,49.279
2020-181656,2020-02-07,000001,Vente,212490,,,CAMPAGNE MAZELINE,B022,14430,14329,Heuland,14,,,143290000A0278,,,,,,,,,,,,,0,,,,,AB,terrains a bâtir,,,1199,-0.000491,49.279476
2020-181657,2020-02-08,000001,Vente,415000,5052,,L AUMONE,B003,14430,14329,Heuland,14,,,143290000A0270,,,,,,,,,,,,,0,1,Maison,126,4,AG,terrains d'agrément,,,1000,0.003563,49.268932
2020-181657,2020-02-08,000001,Vente,415000,5052,,L AUMONE,B003,14430,14329,Heuland,14,,,143290000A0270,,,,,,,,,,,,,0,1,Maison,126,4,PP,prés plantes,,,3342,0.003563,49.268932
2020-181657,2020-02-08,000001,Vente,415000,5052,,L AUMONE,B003,14430,14329,Heuland,14,,,143290000A0270,,,,,,,,,,,,,0,1,Maison,126,4,S,sols,,,500,0.003563,49.268932
2020-181657,2020-02-08,000001,Vente,415000,,,L AUMONE,B003,14430,14329,Heuland,14,,,143290000A0271,,,,,,,,,,,,,0,,,,,S,sols,,,158,0.003077,49.269007
2020-182192,2020-05-07,000001,Vente,580000,5005,,LA CROIX D HEULAND,B084,14430,14329,Heuland,14,,,143290000A0341,,,,,,,,,,,,,0,1,Maison,104,5,S,sols,,,500,-0.001525,49.278635
2020-182192,2020-05-07,000001,Vente,580000,5005,,LA CROIX D HEULAND,B084,14430,14329,Heuland,14,,,143290000A0341,,,,,,,,,,,,,0,1,Maison,150,6,AG,terrains d'agrément,,,2585,-0.001525,49.278635
2020-182192,2020-05-07,000001,Vente,580000,5005,,LA CROIX D HEULAND,B084,14430,14329,Heuland,14,,,143290000A0341,,,,,,,,,,,,,0,1,Maison,150,6,S,sols,,,500,-0.001525,49.278635
2020-182192,2020-05-07,000001,Vente,580000,5005,,LA CROIX D HEULAND,B084,14430,14329,Heuland,14,,,143290000A0341,,,,,,,,,,,,,0,1,Maison,102,5,S,sols,,,500,-0.001525,49.278635
2020-182192,2020-05-07,000001,Vente,580000,5005,,LA CROIX D HEULAND,B084,14430,14329,Heuland,14,,,143290000A0341,,,,,,,,,,,,,0,1,Maison,104,5,AG,terrains d'agrément,,,2585,-0.001525,49.278635
2020-182192,2020-05-07,000001,Vente,580000,5005,,LA CROIX D HEULAND,B084,14430,14329,Heuland,14,,,143290000A0341,,,,,,,,,,,,,0,1,Maison,102,5,AG,terrains d'agrément,,,2585,-0.001525,49.278635
2020-182409,2020-05-13,000001,Vente,75000,,,LA CROIX D HEULAND,B084,14430,14329,Heuland,14,,,143290000A0411,,,,,,,,,,,,,0,,,,,AB,terrains a bâtir,,,2240,0.003917,49.279339
2020-182890,2020-07-02,000001,Vente,252000,5057,,CHEM DE DERENNE,B215,14430,14329,Heuland,14,,,143290000B0175,,,,,,,,,,,,,0,1,Maison,131,7,S,sols,,,1000,-0.004051,49.25655
2020-182890,2020-07-02,000001,Vente,252000,5057,,CHEM DE DERENNE,B215,14430,14329,Heuland,14,,,143290000B0175,,,,,,,,,,,,,0,1,Maison,131,7,P,prés,,,1607,-0.004051,49.25655
2020-183242,2020-08-01,000001,Vente,347000,5043,,L ARGUILLER,B002,14430,14329,Heuland,14,,,143290000A0028,,,,,,,,,,,,,0,1,Maison,94,5,S,sols,,,640,-0.000611,49.270346
2020-183242,2020-08-01,000001,Vente,347000,5043,,L ARGUILLER,B002,14430,14329,Heuland,14,,,143290000A0028,,,,,,,,,,,,,0,1,Maison,94,5,AG,terrains d'agrément,,,5000,-0.000611,49.270346
