id_mutation,date_mutation,numero_disposition,nature_mutation,valeur_fonciere,adresse_numero,adresse_suffixe,adresse_nom_voie,adresse_code_voie,code_postal,code_commune,nom_commune,code_departement,ancien_code_commune,ancien_nom_commune,id_parcelle,ancien_id_parcelle,numero_volume,lot1_numero,lot1_surface_carrez,lot2_numero,lot2_surface_carrez,lot3_numero,lot3_surface_carrez,lot4_numero,lot4_surface_carrez,lot5_numero,lot5_surface_carrez,nombre_lots,code_type_local,type_local,surface_reelle_bati,nombre_pieces_principales,code_nature_culture,nature_culture,code_nature_culture_speciale,nature_culture_speciale,surface_terrain,longitude,latitude
2020-182626,2020-06-24,000001,Vente,1070000,,,LA MARE ELAN,B073,14160,14494,Périers-en-Auge,14,,,144940000B0092,,,,,,,,,,,,,0,,,,,P,prés,,,4000,-0.084209,49.257193
2020-182626,2020-06-24,000001,Vente,1070000,,,LA MARE ELAN,B073,14160,14494,Périers-en-Auge,14,,,144940000B0093,,,,,,,,,,,,,0,,,,,P,prés,,,765,-0.084347,49.257455
2020-182626,2020-06-24,000001,Vente,1070000,,,LA MARE ELAN,B073,14160,14494,Périers-en-Auge,14,,,144940000B0100,,,,,,,,,,,,,0,,,,,P,prés,,,13204,-0.085665,49.25833
2020-182626,2020-06-24,000001,Vente,1070000,,,LA MARE ELAN,B073,14160,14494,Périers-en-Auge,14,,,144940000B0100,,,,,,,,,,,,,0,,,,,PP,prés plantes,,,26406,-0.085665,49.25833
2020-182626,2020-06-24,000001,Vente,1070000,,,LA MARE ELAN,B073,14160,14494,Périers-en-Auge,14,,,144940000B0265,,,,,,,,,,,,,0,,,,,S,sols,,,34,-0.08478,49.257928
2020-182626,2020-06-24,000001,Vente,1070000,5042,,LA MARE ELAN,B073,14160,14494,Périers-en-Auge,14,,,144940000B0266,,,,,,,,,,,,,0,1,Maison,80,3,AG,terrains d'agrément,,,3186,-0.085338,49.257654
2020-182626,2020-06-24,000001,Vente,1070000,5042,,LA MARE ELAN,B073,14160,14494,Périers-en-Auge,14,,,144940000B0266,,,,,,,,,,,,,0,1,Maison,148,3,J,jardins,POTAG,Jardin potager,655,-0.085338,49.257654
2020-182626,2020-06-24,000001,Vente,1070000,5042,,LA MARE ELAN,B073,14160,14494,Périers-en-Auge,14,,,144940000B0266,,,,,,,,,,,,,0,1,Maison,148,3,S,sols,,,1000,-0.085338,49.257654
2020-182626,2020-06-24,000001,Vente,1070000,5042,,LA MARE ELAN,B073,14160,14494,Périers-en-Auge,14,,,144940000B0266,,,,,,,,,,,,,0,1,Maison,180,6,S,sols,,,1000,-0.085338,49.257654
2020-182626,2020-06-24,000001,Vente,1070000,5042,,LA MARE ELAN,B073,14160,14494,Périers-en-Auge,14,,,144940000B0266,,,,,,,,,,,,,0,1,Maison,80,3,S,sols,,,1000,-0.085338,49.257654
2020-182626,2020-06-24,000001,Vente,1070000,5042,,LA MARE ELAN,B073,14160,14494,Périers-en-Auge,14,,,144940000B0266,,,,,,,,,,,,,0,1,Maison,180,6,J,jardins,POTAG,Jardin potager,655,-0.085338,49.257654
2020-182626,2020-06-24,000001,Vente,1070000,5042,,LA MARE ELAN,B073,14160,14494,Périers-en-Auge,14,,,144940000B0266,,,,,,,,,,,,,0,1,Maison,258,4,AG,terrains d'agrément,,,3186,-0.085338,49.257654
2020-182626,2020-06-24,000001,Vente,1070000,5042,,LA MARE ELAN,B073,14160,14494,Périers-en-Auge,14,,,144940000B0266,,,,,,,,,,,,,0,1,Maison,148,3,AG,terrains d'agrément,,,3186,-0.085338,49.257654
2020-182626,2020-06-24,000001,Vente,1070000,5042,,LA MARE ELAN,B073,14160,14494,Périers-en-Auge,14,,,144940000B0266,,,,,,,,,,,,,0,1,Maison,180,6,AG,terrains d'agrément,,,3186,-0.085338,49.257654
2020-182626,2020-06-24,000001,Vente,1070000,5042,,LA MARE ELAN,B073,14160,14494,Périers-en-Auge,14,,,144940000B0266,,,,,,,,,,,,,0,1,Maison,80,3,J,jardins,POTAG,Jardin potager,655,-0.085338,49.257654
2020-182626,2020-06-24,000001,Vente,1070000,5042,,LA MARE ELAN,B073,14160,14494,Périers-en-Auge,14,,,144940000B0266,,,,,,,,,,,,,0,1,Maison,258,4,J,jardins,POTAG,Jardin potager,655,-0.085338,49.257654
2020-182626,2020-06-24,000001,Vente,1070000,5042,,LA MARE ELAN,B073,14160,14494,Périers-en-Auge,14,,,144940000B0266,,,,,,,,,,,,,0,1,Maison,258,4,S,sols,,,1000,-0.085338,49.257654
2020-184209,2020-10-15,000001,Vente,433300,782,,CHE DE BERNIERES,0040,14160,14494,Périers-en-Auge,14,,,144940000A0290,,,,,,,,,,,,,0,1,Maison,144,4,S,sols,,,1000,-0.085763,49.272574
2020-184209,2020-10-15,000001,Vente,433300,782,,CHE DE BERNIERES,0040,14160,14494,Périers-en-Auge,14,,,144940000A0290,,,,,,,,,,,,,0,1,Maison,144,4,AG,terrains d'agrément,,,4920,-0.085763,49.272574
2020-184486,2020-11-06,000001,Vente,20500,,,LES BERGERIES,B006,14160,14494,Périers-en-Auge,14,,,144940000A0122,,,,,,,,,,,,,0,,,,,BT,taillis simples,,,9813,-0.109023,49.26039
2020-184486,2020-11-06,000001,Vente,20500,,,LES BERGERIES,B006,14160,14494,Périers-en-Auge,14,,,144940000A0123,,,,,,,,,,,,,0,,,,,P,prés,,,20880,-0.107518,49.260431
2020-184486,2020-11-06,000001,Vente,20500,,,LES BERGERIES,B006,14160,14494,Périers-en-Auge,14,,,144940000A0124,,,,,,,,,,,,,0,,,,,S,sols,,,126,-0.107946,49.260915
2020-184486,2020-11-06,000001,Vente,20500,,,LES BUTTES,B012,14160,14494,Périers-en-Auge,14,,,144940000A0151,,,,,,,,,,,,,0,,,,,BT,taillis simples,,,2235,-0.112854,49.261477
