id_mutation,date_mutation,numero_disposition,nature_mutation,valeur_fonciere,adresse_numero,adresse_suffixe,adresse_nom_voie,adresse_code_voie,code_postal,code_commune,nom_commune,code_departement,ancien_code_commune,ancien_nom_commune,id_parcelle,ancien_id_parcelle,numero_volume,lot1_numero,lot1_surface_carrez,lot2_numero,lot2_surface_carrez,lot3_numero,lot3_surface_carrez,lot4_numero,lot4_surface_carrez,lot5_numero,lot5_surface_carrez,nombre_lots,code_type_local,type_local,surface_reelle_bati,nombre_pieces_principales,code_nature_culture,nature_culture,code_nature_culture_speciale,nature_culture_speciale,surface_terrain,longitude,latitude
2020-186631,2020-01-16,000001,Vente,51000,5114,,LE MAS,B048,15590,15113,Mandailles-Saint-Julien,15,,,151130000D0139,,,,,,,,,,,,,0,1,Maison,30,1,S,sols,,,59,2.657248,45.070382
2020-186725,2020-02-14,000001,Vente,180000,6062,,FELGEADOU,B023,15590,15113,Mandailles-Saint-Julien,15,,,151131930A0152,,,,,,,,,,,,,0,1,Maison,108,1,S,sols,,,530,2.640371,45.064562
2020-186725,2020-02-14,000001,Vente,180000,,,FELGEADOU,B023,15590,15113,Mandailles-Saint-Julien,15,,,151131930A0217,,,,,,,,,,,,,0,,,,,P,prés,,,1380,2.640667,45.064575
2020-186725,2020-02-14,000001,Vente,180000,,,FELGEADOU,B023,15590,15113,Mandailles-Saint-Julien,15,,,151131930A0217,,,,,,,,,,,,,0,,,,,S,sols,,,50,2.640667,45.064575
2020-187813,2020-06-06,000001,Vente,3000,,,LASTEYRIE,B039,15590,15113,Mandailles-Saint-Julien,15,,,151130000D0045,,,,,,,,,,,,,0,,,,,PA,pâtures,,,680,2.655223,45.071228
2020-187813,2020-06-06,000001,Vente,3000,,,LASTEYRIE,B039,15590,15113,Mandailles-Saint-Julien,15,,,151130000D0046,,,,,,,,,,,,,0,,,,,P,prés,,,1980,2.655523,45.071182
2020-187813,2020-06-06,000001,Vente,3000,,,LASTEYRIE,B039,15590,15113,Mandailles-Saint-Julien,15,,,151130000D0051,,,,,,,,,,,,,0,,,,,P,prés,,,1635,2.655888,45.071477
2020-187935,2020-06-03,000001,Vente,11000,6005,,GARNIERE,B029,15590,15113,Mandailles-Saint-Julien,15,,,151130000B0698,,,,,,,,,,,,,0,3,Dépendance,,0,AG,terrains d'agrément,,,1730,2.649365,45.065724
2020-187935,2020-06-03,000001,Vente,11000,6005,,GARNIERE,B029,15590,15113,Mandailles-Saint-Julien,15,,,151130000B0698,,,,,,,,,,,,,0,3,Dépendance,,0,S,sols,,,500,2.649365,45.065724
2020-188189,2020-07-17,000001,Vente,95000,5071,A,SAINT JULIEN DE JORDANNE,B066,15590,15113,Mandailles-Saint-Julien,15,,,151131930C0354,,,,,,,,,,,,,0,1,Maison,79,4,AG,terrains d'agrément,,,2509,2.637047,45.064319
2020-188189,2020-07-17,000001,Vente,95000,5071,A,SAINT JULIEN DE JORDANNE,B066,15590,15113,Mandailles-Saint-Julien,15,,,151131930C0354,,,,,,,,,,,,,0,1,Maison,79,4,S,sols,,,500,2.637047,45.064319
2020-188271,2020-07-29,000001,Vente,5000,,,BONNEFONS,B008,15590,15113,Mandailles-Saint-Julien,15,,,151130000A0078,,,,,,,,,,,,,0,,,,,PA,pâtures,,,17940,2.688619,45.091619
2020-188271,2020-07-29,000001,Vente,5000,,,BONNEFONS,B008,15590,15113,Mandailles-Saint-Julien,15,,,151130000A0079,,,,,,,,,,,,,0,,,,,S,sols,,,100,2.687606,45.091491
2020-188471,2020-08-25,000001,Vente,64050,5076,,SAINT JULIEN DE JORDANNE,B066,15590,15113,Mandailles-Saint-Julien,15,,,151131930B0063,,,,,,,,,,,,,0,1,Maison,75,4,S,sols,,,96,2.639695,45.06371
2020-188471,2020-08-25,000001,Vente,64050,,,SAINT JULIEN DE JORDANNE,B066,15590,15113,Mandailles-Saint-Julien,15,,,151131930B0068,,,,,,,,,,,,,0,,,,,S,sols,,,100,2.639608,45.063795
2020-188471,2020-08-25,000001,Vente,64050,,,SAINT JULIEN DE JORDANNE,B066,15590,15113,Mandailles-Saint-Julien,15,,,151131930B0659,,,,,,,,,,,,,0,,,,,S,sols,,,28,2.63967,45.063739
2020-188645,2020-09-16,000001,Vente,86.74,,,SAINT JULIEN DE JORDANNE,B066,15590,15113,Mandailles-Saint-Julien,15,,,151131930B0604,,,,,,,,,,,,,0,,,,,P,prés,,,569,,
2020-188646,2020-09-16,000001,Vente,86.02,,,GARNIERE,B029,15590,15113,Mandailles-Saint-Julien,15,,,151130000B0695,,,,,,,,,,,,,0,,,,,BT,taillis simples,,,337,,
2020-188646,2020-09-16,000001,Vente,86.02,,,GARNIERE,B029,15590,15113,Mandailles-Saint-Julien,15,,,151130000B0699,,,,,,,,,,,,,0,,,,,BT,taillis simples,,,143,,
2020-188749,2020-09-29,000001,Vente,37000,5019,,AUBUSSON,B073,15590,15113,Mandailles-Saint-Julien,15,,,151131930C0320,,,,,,,,,,,,,0,1,Maison,86,4,S,sols,,,274,2.614195,45.057478
2020-188749,2020-09-29,000001,Vente,37000,,,LA REVEILADIE AUBUSSON,B061,15590,15113,Mandailles-Saint-Julien,15,,,151131930C0373,,,,,,,,,,,,,0,,,,,J,jardins,,,280,2.614157,45.05754
2020-188800,2020-09-30,000001,Vente,22000,,,ISSARD,B031,15590,15113,Mandailles-Saint-Julien,15,,,151130000C0194,,,,,,,,,,,,,0,,,,,S,sols,,,141,2.667331,45.091865
2020-188800,2020-09-30,000001,Vente,22000,,,ISSARD,B031,15590,15113,Mandailles-Saint-Julien,15,,,151130000C0195,,,,,,,,,,,,,0,,,,,PA,pâtures,,,27330,2.667973,45.091792
2020-188800,2020-09-30,000001,Vente,22000,,,ISSARD,B031,15590,15113,Mandailles-Saint-Julien,15,,,151130000C0196,,,,,,,,,,,,,0,,,,,P,prés,,,22750,2.667924,45.090209
2020-188800,2020-09-30,000001,Vente,22000,,,BOS DALOU,B009,15590,15113,Mandailles-Saint-Julien,15,,,151130000C0326,,,,,,,,,,,,,0,,,,,PA,pâtures,,,10150,2.668345,45.093133
2020-188800,2020-09-30,000001,Vente,22000,,,BOS DALOU,B009,15590,15113,Mandailles-Saint-Julien,15,,,151130000C0327,,,,,,,,,,,,,0,,,,,BT,taillis simples,,,850,2.668137,45.094347
2020-189258,2020-11-10,000001,Vente,27000,,,FELGEADOU,B023,15590,15113,Mandailles-Saint-Julien,15,,,151131930A0186,,,,,,,,,,,,,0,,,,,P,prés,,,664,2.639811,45.06836
2020-189258,2020-11-10,000001,Vente,27000,,,FELGEADOU,B023,15590,15113,Mandailles-Saint-Julien,15,,,151131930A0231,,,,,,,,,,,,,0,,,,,S,sols,,,363,2.640061,45.068413
2020-189444,2020-11-20,000002,Vente,8905.35,,,PICADELLE,B055,15590,15113,Mandailles-Saint-Julien,15,,,151130000A0070,,,,,,,,,,,,,0,,,,,PA,pâtures,,,8360,2.685255,45.094381
2020-189480,2020-11-24,000001,Vente,3000,,,LE CHAMP,B014,15590,15113,Mandailles-Saint-Julien,15,,,151131930D0064,,,,,,,,,,,,,0,,,,,PA,pâtures,,,5434,2.614929,45.051676
2020-189480,2020-11-24,000001,Vente,3000,,,LE CHAMP,B014,15590,15113,Mandailles-Saint-Julien,15,,,151131930D0065,,,,,,,,,,,,,0,,,,,J,jardins,,,280,2.613763,45.051272
2020-189492,2020-11-20,000002,Vente,12000,,,LASTEYRIE,B039,15590,15113,Mandailles-Saint-Julien,15,,,151130000D0085,,,,,,,,,,,,,0,,,,,P,prés,,,2030,2.660607,45.076017
2020-189492,2020-11-20,000002,Vente,12000,,,ALSERRE,B001,15590,15113,Mandailles-Saint-Julien,15,,,151130000D0305,,,,,,,,,,,,,0,,,,,P,prés,,,7522,2.661284,45.076434
2020-189492,2020-11-20,000002,Vente,12000,,,ALSERRE,B001,15590,15113,Mandailles-Saint-Julien,15,,,151130000D0311,,,,,,,,,,,,,0,,,,,P,prés,,,1350,2.660193,45.076295
2020-189492,2020-11-20,000002,Vente,12000,,,ALSERRE,B001,15590,15113,Mandailles-Saint-Julien,15,,,151130000D0515,,,,,,,,,,,,,0,,,,,P,prés,,,6167,2.661963,45.076154
2020-189492,2020-11-20,000002,Vente,12000,,,ALSERRE,B001,15590,15113,Mandailles-Saint-Julien,15,,,151130000D0515,,,,,,,,,,,,,0,,,,,S,sols,,,92,2.661963,45.076154
2020-189492,2020-11-20,000002,Vente,12000,,,ALSERRE,B001,15590,15113,Mandailles-Saint-Julien,15,,,151130000D0515,,,,,,,,,,,,,0,,,,,P,prés,,,3084,2.661963,45.076154
2020-189498,2020-11-27,000001,Vente,2400,,,COURPOU SAUVAGE,B018,15590,15113,Mandailles-Saint-Julien,15,,,151131930B0222,,,,,,,,,,,,,0,,,,,BT,taillis simples,,,18223,2.641261,45.055656
2020-189623,2020-12-05,000001,Vente,110000,5061,,LARMANDIE,B037,15590,15113,Mandailles-Saint-Julien,15,,,151130000B0643,,,,,,,,,,,,,0,1,Maison,130,4,S,sols,,,614,2.656734,45.068584
2020-189623,2020-12-05,000001,Vente,110000,,,LARMANDIE,B037,15590,15113,Mandailles-Saint-Julien,15,,,151130000B0645,,,,,,,,,,,,,0,,,,,P,prés,,,48,2.656768,45.068659
2020-189639,2020-12-09,000001,Vente,80000,,,RAYMOND,B060,15590,15113,Mandailles-Saint-Julien,15,,,151130000C0015,,,,,,,,,,,,,0,,,,,P,prés,,,1546,2.668745,45.083493
2020-189639,2020-12-09,000001,Vente,80000,5027,,RAYMOND,B060,15590,15113,Mandailles-Saint-Julien,15,,,151130000C0016,,,,,,,,,,,,,0,1,Maison,80,2,S,sols,,,35,2.668884,45.083586
2020-189639,2020-12-09,000001,Vente,80000,,,RAYMOND,B060,15590,15113,Mandailles-Saint-Julien,15,,,151130000C0017,,,,,,,,,,,,,0,,,,,S,sols,,,44,2.668929,45.083633
2020-189639,2020-12-09,000001,Vente,80000,,,RAYMOND,B060,15590,15113,Mandailles-Saint-Julien,15,,,151130000C0022,,,,,,,,,,,,,0,,,,,J,jardins,,,170,2.669071,45.083461
2020-189639,2020-12-09,000001,Vente,80000,,,RAYMOND,B060,15590,15113,Mandailles-Saint-Julien,15,,,151130000C0465,,,,,,,,,,,,,0,,,,,S,sols,,,57,2.668921,45.083556
2020-190016,2020-12-30,000001,Adjudication,95200,5069,,LE BOURG,B010,15590,15113,Mandailles-Saint-Julien,15,,,151130000B0571,,,,,,,,,,,,,0,3,Dépendance,,0,S,sols,,,830,2.656002,45.067678
2020-190016,2020-12-30,000001,Adjudication,95200,5069,,LE BOURG,B010,15590,15113,Mandailles-Saint-Julien,15,,,151130000B0571,,,,,,,,,,,,,0,1,Maison,108,7,S,sols,,,830,2.656002,45.067678
2020-190016,2020-12-30,000001,Adjudication,95200,,,LE BOURG,B010,15590,15113,Mandailles-Saint-Julien,15,,,151130000B0594,,,,,,,,,,,,,0,,,,,P,prés,,,1718,2.655858,45.067457
2020-190016,2020-12-30,000001,Adjudication,95200,,,LE BOURG,B010,15590,15113,Mandailles-Saint-Julien,15,,,151130000B0594,,,,,,,,,,,,,0,,,,,S,sols,,,21,2.655858,45.067457
