id_mutation,date_mutation,numero_disposition,nature_mutation,valeur_fonciere,adresse_numero,adresse_suffixe,adresse_nom_voie,adresse_code_voie,code_postal,code_commune,nom_commune,code_departement,ancien_code_commune,ancien_nom_commune,id_parcelle,ancien_id_parcelle,numero_volume,lot1_numero,lot1_surface_carrez,lot2_numero,lot2_surface_carrez,lot3_numero,lot3_surface_carrez,lot4_numero,lot4_surface_carrez,lot5_numero,lot5_surface_carrez,nombre_lots,code_type_local,type_local,surface_reelle_bati,nombre_pieces_principales,code_nature_culture,nature_culture,code_nature_culture_speciale,nature_culture_speciale,surface_terrain,longitude,latitude
2020-186801,2020-02-01,000001,Vente,150000,6047,,LOT COMMUNAL LE CLAUX,A001,15100,15232,Tanavelle,15,,,152320000D0794,,,,,,,,,,,,,0,1,Maison,91,4,S,sols,,,758,2.997119,45.023056
2020-186871,2020-02-14,000001,Vente,190000,,,LE BOURG,B004,15100,15232,Tanavelle,15,,,152320000D0126,,,,,,,,,,,,,0,,,,,L,landes,,,230,3.000056,45.021311
2020-186871,2020-02-14,000001,Vente,190000,,,LE BOURG,B004,15100,15232,Tanavelle,15,,,152320000D0127,,,,,,,,,,,,,0,,,,,L,landes,,,190,3.000266,45.02138
2020-186871,2020-02-14,000001,Vente,190000,,,LE BOURG,B004,15100,15232,Tanavelle,15,,,152320000D0129,,,,,,,,,,,,,0,,,,,S,sols,,,115,3.000679,45.02148
2020-186871,2020-02-14,000001,Vente,190000,5099,,LE BOURG,B004,15100,15232,Tanavelle,15,,,152320000D0130,,,,,,,,,,,,,0,3,Dépendance,,0,S,sols,,,265,3.000627,45.021356
2020-186871,2020-02-14,000001,Vente,190000,,,LE BOURG,B004,15100,15232,Tanavelle,15,,,152320000D0131,,,,,,,,,,,,,0,,,,,L,landes,,,120,3.000531,45.021252
2020-186871,2020-02-14,000001,Vente,190000,,,LE BOURG,B004,15100,15232,Tanavelle,15,,,152320000D0132,,,,,,,,,,,,,0,,,,,PA,pâtures,,,30,3.00061,45.02119
2020-186871,2020-02-14,000001,Vente,190000,,,LE BOURG,B004,15100,15232,Tanavelle,15,,,152320000D0133,,,,,,,,,,,,,0,,,,,PA,pâtures,,,84,3.000536,45.021126
2020-186871,2020-02-14,000001,Vente,190000,5100,A,LE BOURG,B004,15100,15232,Tanavelle,15,,,152320000D0134,,,,,,,,,,,,,0,1,Maison,55,5,S,sols,,,470,3.000322,45.021201
2020-186871,2020-02-14,000001,Vente,190000,,,LE BOURG,B004,15100,15232,Tanavelle,15,,,152320000D0136,,,,,,,,,,,,,0,,,,,T,terres,,,190,2.999816,45.021046
2020-186871,2020-02-14,000001,Vente,190000,,,LE BOURG,B004,15100,15232,Tanavelle,15,,,152320000D0137,,,,,,,,,,,,,0,,,,,J,jardins,,,177,2.999992,45.021201
2020-186871,2020-02-14,000001,Vente,190000,,,LE BOURG,B004,15100,15232,Tanavelle,15,,,152320000D0644,,,,,,,,,,,,,0,,,,,P,prés,,,239,3.000117,45.021063
2020-186871,2020-02-14,000001,Vente,190000,,,LE BOURG,B004,15100,15232,Tanavelle,15,,,152320000D0646,,,,,,,,,,,,,0,,,,,S,sols,,,67,3.000118,45.021266
2020-189618,2020-12-22,000001,Echange,7500,,,ESTOMINES,B025,15100,15232,Tanavelle,15,,,15232000ZH0085,,,,,,,,,,,,,0,,,,,P,prés,,,3340,2.990533,45.036364
2020-189618,2020-12-22,000001,Echange,7500,,,ESTOMINES,B025,15100,15232,Tanavelle,15,,,15232000ZH0086,,,,,,,,,,,,,0,,,,,P,prés,,,2740,2.991743,45.036424
2020-189618,2020-12-22,000001,Echange,7500,,,LES GARDES,B035,15100,15232,Tanavelle,15,,,15232000ZM0001,,,,,,,,,,,,,0,,,,,T,terres,,,9950,2.981761,45.017415
2020-189618,2020-12-22,000001,Echange,7500,,,LES GARDES,B035,15100,15232,Tanavelle,15,,,15232000ZM0001,,,,,,,,,,,,,0,,,,,T,terres,,,9950,2.981761,45.017415
2020-189618,2020-12-22,000002,Echange,7500,,,ESTOMINES,B025,15100,15232,Tanavelle,15,,,15232000ZH0015,,,,,,,,,,,,,0,,,,,PA,pâtures,,,3405,2.992968,45.035541
2020-189618,2020-12-22,000002,Echange,7500,,,ESTOMINES,B025,15100,15232,Tanavelle,15,,,15232000ZH0015,,,,,,,,,,,,,0,,,,,P,prés,,,3445,2.992968,45.035541
2020-189618,2020-12-22,000002,Echange,7500,,,CHAMPGRAND,B011,15100,15232,Tanavelle,15,,,15232000ZI0028,,,,,,,,,,,,,0,,,,,PA,pâtures,,,3413,3.012632,45.026545
2020-189618,2020-12-22,000002,Echange,7500,,,CHAMPGRAND,B011,15100,15232,Tanavelle,15,,,15232000ZI0028,,,,,,,,,,,,,0,,,,,T,terres,,,11747,3.012632,45.026545
