id_mutation,date_mutation,numero_disposition,nature_mutation,valeur_fonciere,adresse_numero,adresse_suffixe,adresse_nom_voie,adresse_code_voie,code_postal,code_commune,nom_commune,code_departement,ancien_code_commune,ancien_nom_commune,id_parcelle,ancien_id_parcelle,numero_volume,lot1_numero,lot1_surface_carrez,lot2_numero,lot2_surface_carrez,lot3_numero,lot3_surface_carrez,lot4_numero,lot4_surface_carrez,lot5_numero,lot5_surface_carrez,nombre_lots,code_type_local,type_local,surface_reelle_bati,nombre_pieces_principales,code_nature_culture,nature_culture,code_nature_culture_speciale,nature_culture_speciale,surface_terrain,longitude,latitude
2020-187771,2020-06-12,000002,Vente,56500,,,MARCOMBES,B034,15400,15246,Valette,15,,,152460000D0404,,,,,,,,,,,,,0,,,,,S,sols,,,790,2.599981,45.257686
2020-188023,2020-07-17,000002,Vente,30000,,,SAGNES,B060,15400,15246,Valette,15,,,152460000E0296,,,,,,,,,,,,,0,,,,,S,sols,,,165,2.588615,45.275025
2020-188023,2020-07-17,000002,Vente,30000,,,SAGNES,B060,15400,15246,Valette,15,,,152460000E0298,,,,,,,,,,,,,0,,,,,PA,pâtures,,,1140,2.588664,45.274875
2020-188023,2020-07-17,000002,Vente,30000,,,SAGNES,B060,15400,15246,Valette,15,,,152460000E0300,,,,,,,,,,,,,0,,,,,PA,pâtures,,,3447,2.588267,45.275001
2020-188023,2020-07-17,000001,Vente,30000,,,SAGNES,B060,15400,15246,Valette,15,,,152460000E0297,,,,,,,,,,,,,0,,,,,S,sols,,,89,2.588741,45.275122
2020-188023,2020-07-17,000001,Vente,30000,,,SAGNES,B060,15400,15246,Valette,15,,,152460000E0299,,,,,,,,,,,,,0,,,,,PA,pâtures,,,411,2.588962,45.275057
2020-188023,2020-07-17,000001,Vente,30000,,,SAGNES,B060,15400,15246,Valette,15,,,152460000E0301,,,,,,,,,,,,,0,,,,,PA,pâtures,,,4252,2.58875,45.275459
2020-189438,2020-11-21,000001,Vente,130000,6045,,LOT COMMUNAL DU BOURG,A010,15400,15246,Valette,15,,,152460000B0504,,,,,,,,,,,,,0,1,Maison,87,3,S,sols,,,756,2.601554,45.269361
2020-189544,2020-11-27,000001,Vente,25000,,,FEVAL,B023,15400,15246,Valette,15,,,152460000B0150,,,,,,,,,,,,,0,,,,,J,jardins,,,525,2.603986,45.278033
2020-189544,2020-11-27,000001,Vente,25000,5006,,FEVAL,B023,15400,15246,Valette,15,,,152460000B0151,,,,,,,,,,,,,0,1,Maison,84,2,S,sols,,,136,2.604095,45.278216
2020-189544,2020-11-27,000001,Vente,25000,,,FEVAL,B023,15400,15246,Valette,15,,,152460000B0152,,,,,,,,,,,,,0,,,,,J,jardins,,,111,2.603905,45.278212
