id_mutation,date_mutation,numero_disposition,nature_mutation,valeur_fonciere,adresse_numero,adresse_suffixe,adresse_nom_voie,adresse_code_voie,code_postal,code_commune,nom_commune,code_departement,ancien_code_commune,ancien_nom_commune,id_parcelle,ancien_id_parcelle,numero_volume,lot1_numero,lot1_surface_carrez,lot2_numero,lot2_surface_carrez,lot3_numero,lot3_surface_carrez,lot4_numero,lot4_surface_carrez,lot5_numero,lot5_surface_carrez,nombre_lots,code_type_local,type_local,surface_reelle_bati,nombre_pieces_principales,code_nature_culture,nature_culture,code_nature_culture_speciale,nature_culture_speciale,surface_terrain,longitude,latitude
2020-190136,2020-01-13,000001,Vente,106500,,,CHEZ BERNARD,B029,16320,16103,Combiers,16,,,161030000D0254,,,,,,,,,,,,,0,,,,,J,jardins,,,620,0.406689,45.503313
2020-190136,2020-01-13,000001,Vente,106500,3,,IMP DE LA  FONTAINE,0210,16320,16103,Combiers,16,,,161030000D0701,,,,,,,,,,,,,0,1,Maison,112,2,S,sols,,,350,0.406596,45.503136
2020-190136,2020-01-13,000001,Vente,106500,,,CHEZ BERNARD,B029,16320,16103,Combiers,16,,,161030000D0704,,,,,,,,,,,,,0,,,,,J,jardins,,,280,0.406527,45.503239
2020-190136,2020-01-13,000001,Vente,106500,,,CHEZ BERNARD,B029,16320,16103,Combiers,16,,,161030000D0706,,,,,,,,,,,,,0,,,,,S,sols,,,15,0.406527,45.503116
2020-190136,2020-01-13,000001,Vente,106500,,,CHEZ BERNARD,B029,16320,16103,Combiers,16,,,161030000D0707,,,,,,,,,,,,,0,,,,,P,prés,,,553,0.406384,45.503467
2020-190136,2020-01-13,000001,Vente,106500,,,CHEZ BERNARD,B029,16320,16103,Combiers,16,,,161030000D0710,,,,,,,,,,,,,0,,,,,J,jardins,,,207,0.406139,45.503596
2020-191430,2020-05-26,000001,Vente,191600,3,,CHE DE LA PAYRE,0400,16320,16103,Combiers,16,,,161030000D0265,,,,,,,,,,,,,0,1,Maison,131,6,S,sols,,,1440,0.405598,45.504611
2020-191430,2020-05-26,000001,Vente,191600,,,CHEZ BERNARD,B029,16320,16103,Combiers,16,,,161030000D0735,,,,,,,,,,,,,0,,,,,T,terres,,,92,0.405822,45.5044
2020-192075,2020-07-22,000001,Vente,12000,,,LES PRADELLES,B094,16320,16103,Combiers,16,,,161030000E0104,,,,,,,,,,,,,0,,,,,BT,taillis simples,,,10035,0.380052,45.51378
2020-192075,2020-07-22,000001,Vente,12000,,,LES PRADELLES,B094,16320,16103,Combiers,16,,,161030000E0107,,,,,,,,,,,,,0,,,,,BS,taillis sous futaie,,,8906,0.379455,45.51484
2020-192075,2020-07-22,000001,Vente,12000,,,LES GRILLAUDS,B076,16320,16103,Combiers,16,,,161030000E0116,,,,,,,,,,,,,0,,,,,BS,taillis sous futaie,,,33480,0.383183,45.514314
2020-192075,2020-07-22,000001,Vente,12000,,,LES GRILLAUDS,B076,16320,16103,Combiers,16,,,161030000E0117,,,,,,,,,,,,,0,,,,,BS,taillis sous futaie,,,1295,0.382414,45.514039
2020-192387,2020-08-10,000001,Vente,152000,,,CHEZ PARRUCOUD,B037,16320,16103,Combiers,16,,,161030000A0098,,,,,,,,,,,,,0,,,,,J,jardins,,,1380,0.41568,45.515339
2020-192387,2020-08-10,000001,Vente,152000,1,,IMP CHEZ PARRUCOUD,0160,16320,16103,Combiers,16,,,161030000A0099,,,,,,,,,,,,,0,1,Maison,119,2,S,sols,,,1265,0.415921,45.515023
2020-192387,2020-08-10,000001,Vente,152000,,,CHEZ PARRUCOUD,B037,16320,16103,Combiers,16,,,161030000A0204,,,,,,,,,,,,,0,,,,,P,prés,,,40,0.41549,45.515145
2020-192387,2020-08-10,000001,Vente,152000,,,CHEZ PARRUCOUD,B037,16320,16103,Combiers,16,,,161030000A0206,,,,,,,,,,,,,0,,,,,P,prés,,,365,0.415838,45.514877
2020-193109,2020-09-15,000001,Vente,65000,,,LA CHAPELLIE,B026,16320,16103,Combiers,16,,,161030000E0165,,,,,,,,,,,,,0,,,,,S,sols,,,150,0.394603,45.505545
2020-193109,2020-09-15,000001,Vente,65000,1,,CHE DES CERCLIERS,0060,16320,16103,Combiers,16,,,161030000E0174,,,,,,,,,,,,,0,1,Maison,98,4,S,sols,,,95,0.39415,45.505586
2020-193109,2020-09-15,000001,Vente,65000,5074,,LA CHAPELLIE,B026,16320,16103,Combiers,16,,,161030000E0176,,,,,,,,,,,,,0,1,Maison,26,2,S,sols,,,25,0.394433,45.505511
2020-193109,2020-09-15,000001,Vente,65000,,,LA CHAPELLIE,B026,16320,16103,Combiers,16,,,161030000E0177,,,,,,,,,,,,,0,,,,,S,sols,,,225,0.394301,45.505518
2020-193109,2020-09-15,000001,Vente,65000,,,LA CHAPELLIE,B026,16320,16103,Combiers,16,,,161030000E0180,,,,,,,,,,,,,0,,,,,J,jardins,,,445,0.394418,45.505397
2020-194330,2020-10-20,000001,Vente,31500,13,,RUE DES VIEILLES  FORGES,0620,16320,16103,Combiers,16,,,161030000C0015,,,,,,,,,,,,,0,1,Maison,30,2,S,sols,,,389,0.416666,45.491602
2020-194330,2020-10-20,000001,Vente,31500,,,LE BOURG,B021,16320,16103,Combiers,16,,,161030000C0016,,,,,,,,,,,,,0,,,,,T,terres,,,991,0.416755,45.491687
