id_mutation,date_mutation,numero_disposition,nature_mutation,valeur_fonciere,adresse_numero,adresse_suffixe,adresse_nom_voie,adresse_code_voie,code_postal,code_commune,nom_commune,code_departement,ancien_code_commune,ancien_nom_commune,id_parcelle,ancien_id_parcelle,numero_volume,lot1_numero,lot1_surface_carrez,lot2_numero,lot2_surface_carrez,lot3_numero,lot3_surface_carrez,lot4_numero,lot4_surface_carrez,lot5_numero,lot5_surface_carrez,nombre_lots,code_type_local,type_local,surface_reelle_bati,nombre_pieces_principales,code_nature_culture,nature_culture,code_nature_culture_speciale,nature_culture_speciale,surface_terrain,longitude,latitude
2020-193230,2020-09-10,000001,Vente,140000,,,LA SABLIERE,B113,16240,16190,Longré,16,,,161900000B0016,,,,,,,,,,,,,0,,,,,BT,taillis simples,,,1040,-0.036973,46.003746
2020-193230,2020-09-10,000001,Vente,140000,,,LA SABLIERE,B113,16240,16190,Longré,16,,,161900000B0017,,,,,,,,,,,,,0,,,,,T,terres,,,6137,-0.037579,46.003635
2020-193230,2020-09-10,000001,Vente,140000,,,BELLAVEAU,B004,16240,16190,Longré,16,,,161900000B0046,,,,,,,,,,,,,0,,,,,S,sols,,,380,-0.037077,46.004659
2020-193230,2020-09-10,000001,Vente,140000,,,BELLAVEAU,B004,16240,16190,Longré,16,,,161900000B0047,,,,,,,,,,,,,0,,,,,T,terres,,,1778,-0.036638,46.004394
2020-193230,2020-09-10,000001,Vente,140000,,,BELLAVEAU,B004,16240,16190,Longré,16,,,161900000B0579,,,,,,,,,,,,,0,,,,,S,sols,,,172,-0.037035,46.004754
2020-193230,2020-09-10,000001,Vente,140000,,,LA SABLIERE,B113,16240,16190,Longré,16,,,161900000B0765,,,,,,,,,,,,,0,,,,,S,sols,,,1534,-0.037188,46.004286
2020-193230,2020-09-10,000001,Vente,140000,,,LA SABLIERE,B113,16240,16190,Longré,16,,,161900000B0765,,,,,,,,,,,,,0,,,,,T,terres,,,5498,-0.037188,46.004286
2020-193230,2020-09-10,000001,Vente,140000,3,,RUE DES RIVAUX,0105,16240,16190,Longré,16,,,161900000B0766,,,,,,,,,,,,,0,1,Maison,154,7,S,sols,,,940,-0.038287,46.004052
2020-193230,2020-09-10,000001,Vente,140000,3,,RUE DES RIVAUX,0105,16240,16190,Longré,16,,,161900000B0766,,,,,,,,,,,,,0,1,Maison,154,7,T,terres,,,1020,-0.038287,46.004052
2020-193230,2020-09-10,000001,Vente,140000,,,LA SABLIERE,B113,16240,16190,Longré,16,,,161900000B0768,,,,,,,,,,,,,0,,,,,T,terres,,,1113,-0.037823,46.004428
2020-193509,2020-09-24,000001,Vente,32754.62,,,PEDOREAU,B086,16240,16190,Longré,16,,,161900000D0253,,,,,,,,,,,,,0,,,,,T,terres,,,18120,-0.021279,45.989725
2020-193509,2020-09-24,000001,Vente,32754.62,,,PEDOREAU,B086,16240,16190,Longré,16,,,161900000D1045,,,,,,,,,,,,,0,,,,,T,terres,,,9928,-0.021267,45.99055
2020-193509,2020-09-24,000001,Vente,32754.62,,,PEDOREAU,B086,16240,16190,Longré,16,,,161900000D1048,,,,,,,,,,,,,0,,,,,T,terres,,,8826,-0.021518,45.992636
2020-193509,2020-09-24,000001,Vente,32754.62,,,PEDOREAU,B086,16240,16190,Longré,16,,,161900000D1049,,,,,,,,,,,,,0,,,,,T,terres,,,16532,-0.020254,45.993223
2020-193509,2020-09-24,000001,Vente,32754.62,,,LES BAUDOUSES,B002,16240,16190,Longré,16,,,161900000D1067,,,,,,,,,,,,,0,,,,,T,terres,,,10824,-0.019133,45.993826
2020-193509,2020-09-24,000001,Vente,32754.62,,,LES BAUDOUSES,B002,16240,16190,Longré,16,,,161900000D1087,,,,,,,,,,,,,0,,,,,T,terres,,,5296,-0.018649,45.994086
2020-194540,2020-10-30,000001,Vente,1491.75,,,BOIS BERTEAU,B005,16240,16190,Longré,16,,,161900000E1768,,,,,,,,,,,,,0,,,,,CA,carrières,SABLE,Sablière,3315,-0.011343,45.976043
2020-194575,2020-10-23,000001,Vente,96817.67,,,AU MOULIN A VENT,B077,16240,16190,Longré,16,,,161900000D1082,,,,,,,,,,,,,0,,,,,T,terres,,,5673,-0.017256,45.986403
2020-194575,2020-10-23,000001,Vente,96817.67,,,AU MOULIN A VENT,B077,16240,16190,Longré,16,,,161900000D1083,,,,,,,,,,,,,0,,,,,T,terres,,,282,,
2020-194576,2020-10-23,000001,Vente,59370.33,,,AU MOULIN A VENT,B077,16240,16190,Longré,16,,,161900000D1085,,,,,,,,,,,,,0,,,,,T,terres,,,1998,-0.017338,45.987289
2020-194576,2020-10-23,000001,Vente,59370.33,,,AU MOULIN A VENT,B077,16240,16190,Longré,16,,,161900000D1086,,,,,,,,,,,,,0,,,,,T,terres,,,448,,
2020-194621,2020-10-30,000001,Vente,1163.25,,,BOIS BERTEAU,B005,16240,16190,Longré,16,,,161900000E1034,,,,,,,,,,,,,0,,,,,T,terres,,,2585,-0.012617,45.976146
2020-194706,2020-11-10,000001,Vente,150000,2,,RUE DE LA FERTILIERE,0050,16240,16190,Longré,16,,,161900000B0752,,,,,,,,,,,,,0,1,Maison,180,5,S,sols,,,1255,-0.012491,46.001394
2020-195631,2020-12-09,000002,Vente,14000,,,LE BOURG,B017,16240,16190,Longré,16,,,161900000B0440,,,,,,,,,,,,,0,,,,,T,terres,,,1130,-0.011221,46.000257
2020-195631,2020-12-09,000002,Vente,14000,,,LE BOURG,B017,16240,16190,Longré,16,,,161900000B0972,,,,,,,,,,,,,0,,,,,S,sols,,,325,-0.011277,46.000482
2020-197165,2020-02-05,000001,Vente,32000,,,BOIS DES BOQUETS,B010,16240,16190,Longré,16,,,161900000E0552,,,,,,,,,,,,,0,,,,,BT,taillis simples,,,2036,-0.031196,45.981482
2020-197165,2020-02-05,000001,Vente,32000,,,BOIS DES BOQUETS,B010,16240,16190,Longré,16,,,161900000E0575,,,,,,,,,,,,,0,,,,,BT,taillis simples,,,2435,-0.032364,45.981707
2020-198017,2020-06-16,000001,Vente,40000,,,A VILLE MORIN,B128,16240,16190,Longré,16,,,161900000D0978,,,,,,,,,,,,,0,,,,,P,prés,,,1256,-0.010371,45.986587
2020-198017,2020-06-16,000001,Vente,40000,,,A VILLE MORIN,B128,16240,16190,Longré,16,,,161900000D0978,,,,,,,,,,,,,0,,,,,BP,peupleraies,,,960,-0.010371,45.986587
2020-198017,2020-06-16,000001,Vente,40000,,,BOIS DES BOQUETS,B010,16240,16190,Longré,16,,,161900000E0504,,,,,,,,,,,,,0,,,,,BT,taillis simples,,,1200,-0.028392,45.979684
2020-198017,2020-06-16,000001,Vente,40000,,,BOIS DES BOQUETS,B010,16240,16190,Longré,16,,,161900000E0548,,,,,,,,,,,,,0,,,,,BT,taillis simples,,,10280,-0.032208,45.980783
2020-198017,2020-06-16,000001,Vente,40000,,,PETITE FORET,B088,16240,16190,Longré,16,,,161900000E0828,,,,,,,,,,,,,0,,,,,BT,taillis simples,,,7000,-0.015778,45.971657
2020-198017,2020-06-16,000001,Vente,40000,,,FOURLACHAUD,B054,16240,16190,Longré,16,,,161900000E0891,,,,,,,,,,,,,0,,,,,T,terres,,,6428,-0.018704,45.97494
2020-198017,2020-06-16,000001,Vente,40000,,,BOIS DES BOQUETS,B010,16240,16190,Longré,16,,,161900000E1721,,,,,,,,,,,,,0,,,,,BT,taillis simples,,,3480,-0.029245,45.979042
2020-198017,2020-06-16,000001,Vente,40000,,,LES PIERRIERES,B093,16240,16190,Longré,16,,,161900000E1734,,,,,,,,,,,,,0,,,,,T,terres,,,2602,-0.025748,45.982211
2020-198017,2020-06-16,000001,Vente,40000,,,CHE DE LA CHAUME,0020,16240,16190,Longré,16,,,161900000E1757,,,,,,,,,,,,,0,,,,,T,terres,,,53525,-0.012486,45.980868
2020-198017,2020-06-16,000001,Vente,40000,,,LA GIBAUDERIE,B056,16240,16190,Longré,16,,,16190000ZA0040,,,,,,,,,,,,,0,,,,,P,prés,,,7520,-0.008301,45.976022
2020-198421,2020-07-28,000001,Vente,5500,,,LES BAUDOUSES,B002,16240,16190,Longré,16,,,161900000D0295,,,,,,,,,,,,,0,,,,,BT,taillis simples,,,875,-0.019988,45.994197
2020-198421,2020-07-28,000001,Vente,5500,,,BOIS GIRAUD,B011,16240,16190,Longré,16,,,161900000E0431,,,,,,,,,,,,,0,,,,,BT,taillis simples,,,2700,-0.026786,45.974771
2020-198421,2020-07-28,000001,Vente,5500,,,BOIS GIRAUD,B011,16240,16190,Longré,16,,,161900000E0455,,,,,,,,,,,,,0,,,,,BT,taillis simples,,,21890,-0.025199,45.978171
2020-198421,2020-07-28,000001,Vente,5500,,,BOIS DES BOQUETS,B010,16240,16190,Longré,16,,,161900000E0483,,,,,,,,,,,,,0,,,,,BT,taillis simples,,,12290,-0.031997,45.976317
2020-198442,2020-08-05,000001,Vente,750,,,DERRIERE LES JARDINS,B048,16240,16190,Longré,16,,,161900000D0001,,,,,,,,,,,,,0,,,,,J,jardins,,,880,-0.010028,46.000293
