id_mutation,date_mutation,numero_disposition,nature_mutation,valeur_fonciere,adresse_numero,adresse_suffixe,adresse_nom_voie,adresse_code_voie,code_postal,code_commune,nom_commune,code_departement,ancien_code_commune,ancien_nom_commune,id_parcelle,ancien_id_parcelle,numero_volume,lot1_numero,lot1_surface_carrez,lot2_numero,lot2_surface_carrez,lot3_numero,lot3_surface_carrez,lot4_numero,lot4_surface_carrez,lot5_numero,lot5_surface_carrez,nombre_lots,code_type_local,type_local,surface_reelle_bati,nombre_pieces_principales,code_nature_culture,nature_culture,code_nature_culture_speciale,nature_culture_speciale,surface_terrain,longitude,latitude
2020-192984,2020-09-03,000002,Vente,90000,5129,,RUE DE LA COMBE,0035,16120,16233,Mosnac,16,,,162330000A1601,,,,,,,,,,,,,0,1,Maison,77,3,S,sols,,,271,-0.013507,45.620251
2020-192984,2020-09-03,000002,Vente,90000,5129,,RUE DE LA COMBE,0035,16120,16233,Mosnac,16,,,162330000A1601,,,,,,,,,,,,,0,3,Dépendance,,0,S,sols,,,271,-0.013507,45.620251
2020-193040,2020-09-11,000001,Vente,175000,13,,RUE DES ECOLES,0045,16120,16233,Mosnac,16,,,162330000B0045,,,,,,,,,,,,,0,1,Maison,173,6,S,sols,,,530,-0.01786,45.620199
2020-193040,2020-09-11,000001,Vente,175000,,,PRES DE LA SALLE,B061,16120,16233,Mosnac,16,,,162330000B0046,,,,,,,,,,,,,0,,,,,T,terres,,,2340,-0.018282,45.620239
2020-193040,2020-09-11,000001,Vente,175000,,,PRES DE LA SALLE,B061,16120,16233,Mosnac,16,,,162330000B0578,,,,,,,,,,,,,0,,,,,L,landes,,,180,-0.018121,45.6203
2020-193323,2020-09-09,000001,Vente,120000,,,PETITES GROIES,B056,16120,16233,Mosnac,16,,,162330000A0958,,,,,,,,,,,,,0,,,,,T,terres,,,1680,-0.010451,45.61676
2020-193323,2020-09-09,000001,Vente,120000,3,,RUE DES PETITES GROIES,0085,16120,16233,Mosnac,16,,,162330000A0959,,,,,,,,,,,,,0,1,Maison,156,5,S,sols,,,1340,-0.010747,45.6166
2020-196879,2020-11-25,000001,Vente,34000,,,LA COMBE,B020,16120,16233,Mosnac,16,,,162330000A1593,,,,,,,,,,,,,0,,,,,AB,terrains a bâtir,,,901,-0.012667,45.618908
2020-196879,2020-11-25,000001,Vente,34000,,,LA COMBE,B020,16120,16233,Mosnac,16,,,162330000A1596,,,,,,,,,,,,,0,,,,,AB,terrains a bâtir,,,415,-0.012422,45.619017
2020-196879,2020-11-25,000001,Vente,34000,,,LA COMBE,B020,16120,16233,Mosnac,16,,,162330000A1597,,,,,,,,,,,,,0,,,,,AB,terrains a bâtir,,,33,-0.012047,45.618724
2020-198648,2020-01-07,000001,Vente,186000,25,,RTE D ANGOULEME,0006,16120,16233,Mosnac,16,,,162330000A1518,,,,,,,,,,,,,0,1,Maison,111,5,S,sols,,,500,-0.008962,45.614123
2020-198648,2020-01-07,000001,Vente,186000,25,,RTE D ANGOULEME,0006,16120,16233,Mosnac,16,,,162330000A1518,,,,,,,,,,,,,0,1,Maison,111,5,J,jardins,,,1422,-0.008962,45.614123
2020-198929,2020-03-04,000001,Vente,1443,,,LE BOIS DE LA LIEGE,B007,16120,16233,Mosnac,16,,,162330000A1341,,,,,,,,,,,,,0,,,,,T,terres,,,1443,-0.00851,45.62466
2020-199286,2020-06-05,000001,Vente,10332,12,,RUE DE LA MAIRIE,0075,16120,16233,Mosnac,16,,,16233000ZC0065,,,,,,,,,,,,,0,,,,,AG,terrains d'agrément,SPORT,Terrain de sport,12915,-0.020259,45.616281
2020-199480,2020-07-17,000001,Vente,65000,5102,,LA BARRIERE,B001,16120,16233,Mosnac,16,,,162330000B0498,,,,,,,,,,,,,0,1,Maison,80,1,S,sols,,,2180,-0.020801,45.615693
2020-199555,2020-07-30,000001,Vente,130000,,,LES CORBEAUX,B022,16120,16233,Mosnac,16,,,16233000ZC0025,,,,,,,,,,,,,0,,,,,BP,peupleraies,,,8230,-0.020976,45.621093
2020-199555,2020-07-30,000001,Vente,130000,,,LES CORBEAUX,B022,16120,16233,Mosnac,16,,,16233000ZC0077,,,,,,,,,,,,,0,,,,,AG,terrains d'agrément,,,739,-0.024819,45.619919
2020-199555,2020-07-30,000001,Vente,130000,,,LES CORBEAUX,B022,16120,16233,Mosnac,16,,,16233000ZC0079,,,,,,,,,,,,,0,,,,,AG,terrains d'agrément,,,1260,-0.024626,45.620142
2020-199555,2020-07-30,000001,Vente,130000,,,LES CORBEAUX,B022,16120,16233,Mosnac,16,,,16233000ZC0080,,,,,,,,,,,,,0,,,,,AG,terrains d'agrément,,,1268,-0.024726,45.620326
2020-199555,2020-07-30,000001,Vente,130000,,,LES CORBEAUX,B022,16120,16233,Mosnac,16,,,16233000ZC0081,,,,,,,,,,,,,0,,,,,AG,terrains d'agrément,,,1286,-0.024628,45.620449
2020-199555,2020-07-30,000001,Vente,130000,,,LES CORBEAUX,B022,16120,16233,Mosnac,16,,,16233000ZC0082,,,,,,,,,,,,,0,,,,,AG,terrains d'agrément,,,1271,-0.024629,45.620602
2020-199555,2020-07-30,000001,Vente,130000,,,LES CORBEAUX,B022,16120,16233,Mosnac,16,,,16233000ZC0083,,,,,,,,,,,,,0,,,,,AG,terrains d'agrément,,,1270,-0.02463,45.620755
2020-199555,2020-07-30,000001,Vente,130000,,,LES CORBEAUX,B022,16120,16233,Mosnac,16,,,16233000ZC0084,,,,,,,,,,,,,0,,,,,AG,terrains d'agrément,,,6489,-0.024912,45.621225
2020-199555,2020-07-30,000001,Vente,130000,,,LES CORBEAUX,B022,16120,16233,Mosnac,16,,,16233000ZC0085,,,,,,,,,,,,,0,,,,,AG,terrains d'agrément,,,30458,-0.023442,45.620737
2020-199555,2020-07-30,000001,Vente,130000,,,LES CORBEAUX,B022,16120,16233,Mosnac,16,,,16233000ZC0085,,,,,,,,,,,,,0,,,,,E,eaux,ETANG,Etangs,38768,-0.023442,45.620737
