id_mutation,date_mutation,numero_disposition,nature_mutation,valeur_fonciere,adresse_numero,adresse_suffixe,adresse_nom_voie,adresse_code_voie,code_postal,code_commune,nom_commune,code_departement,ancien_code_commune,ancien_nom_commune,id_parcelle,ancien_id_parcelle,numero_volume,lot1_numero,lot1_surface_carrez,lot2_numero,lot2_surface_carrez,lot3_numero,lot3_surface_carrez,lot4_numero,lot4_surface_carrez,lot5_numero,lot5_surface_carrez,nombre_lots,code_type_local,type_local,surface_reelle_bati,nombre_pieces_principales,code_nature_culture,nature_culture,code_nature_culture_speciale,nature_culture_speciale,surface_terrain,longitude,latitude
2020-219222,2020-01-16,000001,Vente,300,,,LES GAUTRAUX,B059,17210,17038,Bedenac,17,,,17038000AS0104,,,,,,,,,,,,,0,,,,,B,bois,,,3070,-0.310629,45.161924
2020-219305,2020-01-31,000001,Vente,4300,,,CHEMIN DE CHEPNIERS,B037,17210,17038,Bedenac,17,,,17038000AB0203,,,,,,,,,,,,,0,,,,,B,bois,,,1535,-0.305344,45.216168
2020-219305,2020-01-31,000001,Vente,4300,,,CHEMIN DE CHEPNIERS,B037,17210,17038,Bedenac,17,,,17038000AB0203,,,,,,,,,,,,,0,,,,,BR,futaies résineuses,,,17200,-0.305344,45.216168
2020-219331,2020-02-19,000001,Vente,180000,5103,,MOULIN DES ROIS,B100,17210,17038,Bedenac,17,,,17038000ZB0109,,,,,,,,,,,,,0,1,Maison,200,6,B,bois,,,44964,-0.308773,45.203834
2020-219331,2020-02-19,000001,Vente,180000,5103,,MOULIN DES ROIS,B100,17210,17038,Bedenac,17,,,17038000ZB0109,,,,,,,,,,,,,0,1,Maison,200,6,L,landes,FRICH,Friche,99,-0.308773,45.203834
2020-219331,2020-02-19,000001,Vente,180000,5103,,MOULIN DES ROIS,B100,17210,17038,Bedenac,17,,,17038000ZB0109,,,,,,,,,,,,,0,1,Maison,200,6,S,sols,,,2236,-0.308773,45.203834
2020-219331,2020-02-19,000001,Vente,180000,5103,,MOULIN DES ROIS,B100,17210,17038,Bedenac,17,,,17038000ZB0109,,,,,,,,,,,,,0,1,Maison,200,6,T,terres,,,4973,-0.308773,45.203834
2020-219331,2020-02-19,000001,Vente,180000,5103,,MOULIN DES ROIS,B100,17210,17038,Bedenac,17,,,17038000ZB0109,,,,,,,,,,,,,0,1,Maison,200,6,B,bois,,,5650,-0.308773,45.203834
2020-219331,2020-02-19,000001,Vente,180000,,,MOULIN DES ROIS,B100,17210,17038,Bedenac,17,,,17038000ZB0115,,,,,,,,,,,,,0,,,,,L,landes,FRICH,Friche,1320,-0.308755,45.20559
2020-219331,2020-02-19,000001,Vente,180000,,,MOULIN DES ROIS,B100,17210,17038,Bedenac,17,,,17038000ZB0115,,,,,,,,,,,,,0,,,,,P,prés,,,37334,-0.308755,45.20559
2020-219331,2020-02-19,000001,Vente,180000,,,MOULIN DES ROIS,B100,17210,17038,Bedenac,17,,,17038000ZB0115,,,,,,,,,,,,,0,,,,,B,bois,,,16827,-0.308755,45.20559
2020-219331,2020-02-19,000001,Vente,180000,,,MOULIN DES ROIS,B100,17210,17038,Bedenac,17,,,17038000ZB0115,,,,,,,,,,,,,0,,,,,BT,taillis simples,,,1546,-0.308755,45.20559
2020-219422,2020-02-25,000001,Vente,1000,,,PAS DE LA PIERRE,B113,17210,17038,Bedenac,17,,,17038000AS0224,,,,,,,,,,,,,0,,,,,BR,futaies résineuses,,,2421,-0.304105,45.161778
2020-219422,2020-02-25,000001,Vente,1000,,,PAS DE LA PIERRE,B113,17210,17038,Bedenac,17,,,17038000AS0226,,,,,,,,,,,,,0,,,,,BR,futaies résineuses,,,1039,-0.30372,45.16163
2020-219686,2020-05-12,000001,Vente,70000,,,PRE DU NOUZILLON,B140,17210,17038,Bedenac,17,,,17038000AV0015,,,,,,,,,,,,,0,,,,,BR,futaies résineuses,,,696,-0.321157,45.16048
2020-219686,2020-05-12,000001,Vente,70000,,,PRE DU NOUZILLON,B140,17210,17038,Bedenac,17,,,17038000AV0017,,,,,,,,,,,,,0,,,,,BT,taillis simples,,,1223,-0.321546,45.16128
2020-219686,2020-05-12,000001,Vente,70000,,,PRE DU NOUZILLON,B140,17210,17038,Bedenac,17,,,17038000AV0018,,,,,,,,,,,,,0,,,,,B,bois,,,7365,-0.322105,45.162132
2020-219686,2020-05-12,000001,Vente,70000,,,PRE DU NOUZILLON,B140,17210,17038,Bedenac,17,,,17038000AV0020,,,,,,,,,,,,,0,,,,,B,bois,,,1192,-0.322379,45.161737
2020-219686,2020-05-12,000001,Vente,70000,,,PRE DU NOUZILLON,B140,17210,17038,Bedenac,17,,,17038000AV0021,,,,,,,,,,,,,0,,,,,B,bois,,,2791,-0.322672,45.16146
2020-219686,2020-05-12,000001,Vente,70000,,,PRE DU NOUZILLON,B140,17210,17038,Bedenac,17,,,17038000AV0022,,,,,,,,,,,,,0,,,,,B,bois,,,955,-0.322917,45.161736
2020-219686,2020-05-12,000001,Vente,70000,,,BOIS DU NOUZILLON,B020,17210,17038,Bedenac,17,,,17038000AV0039,,,,,,,,,,,,,0,,,,,BR,futaies résineuses,,,28400,,
2020-219686,2020-05-12,000001,Vente,70000,,,BOIS DU NOUZILLON,B020,17210,17038,Bedenac,17,,,17038000AV0048,,,,,,,,,,,,,0,,,,,BR,futaies résineuses,,,31041,-0.31912,45.160849
2020-219686,2020-05-12,000001,Vente,70000,,,LE CAILLOU,B030,17210,17038,Bedenac,17,,,17038000AV0051,,,,,,,,,,,,,0,,,,,BR,futaies résineuses,,,81843,,
2020-219686,2020-05-12,000001,Vente,70000,,,LE CAILLOU,B030,17210,17038,Bedenac,17,,,17038000AV0062,,,,,,,,,,,,,0,,,,,BR,futaies résineuses,,,45852,-0.313057,45.163249
2020-219686,2020-05-12,000001,Vente,70000,,,LE CAILLOU,B030,17210,17038,Bedenac,17,,,17038000AV0063,,,,,,,,,,,,,0,,,,,L,landes,FRICH,Friche,297,-0.313604,45.161747
2020-219686,2020-05-12,000001,Vente,70000,,,COMBES SUD,B042,17210,17038,Bedenac,17,,,17038000AW0101,,,,,,,,,,,,,0,,,,,BR,futaies résineuses,,,19691,-0.323136,45.167178
2020-219686,2020-05-12,000001,Vente,70000,,,COMBES SUD,B042,17210,17038,Bedenac,17,,,17038000AW0102,,,,,,,,,,,,,0,,,,,BR,futaies résineuses,,,4438,-0.322487,45.167417
2020-219686,2020-05-12,000001,Vente,70000,,,COMBES SUD,B042,17210,17038,Bedenac,17,,,17038000AW0103,,,,,,,,,,,,,0,,,,,BR,futaies résineuses,,,13690,-0.323133,45.166268
2020-219686,2020-05-12,000001,Vente,70000,,,COMBES SUD,B042,17210,17038,Bedenac,17,,,17038000AW0106,,,,,,,,,,,,,0,,,,,BR,futaies résineuses,,,26585,-0.321628,45.166222
2020-219686,2020-05-12,000001,Vente,70000,,,COMBES SUD,B042,17210,17038,Bedenac,17,,,17038000AW0107,,,,,,,,,,,,,0,,,,,B,bois,,,7691,-0.322005,45.16768
2020-219686,2020-05-12,000001,Vente,70000,,,COMBES SUD,B042,17210,17038,Bedenac,17,,,17038000AW0108,,,,,,,,,,,,,0,,,,,B,bois,,,3204,-0.321754,45.168019
2020-219686,2020-05-12,000001,Vente,70000,,,COMBES SUD,B042,17210,17038,Bedenac,17,,,17038000AW0113,,,,,,,,,,,,,0,,,,,BT,taillis simples,,,1351,-0.315205,45.167258
2020-219686,2020-05-12,000001,Vente,70000,,,COMBES SUD,B042,17210,17038,Bedenac,17,,,17038000AW0114,,,,,,,,,,,,,0,,,,,B,bois,,,3110,-0.314965,45.167285
2020-219686,2020-05-12,000001,Vente,70000,,,COMBES SUD,B042,17210,17038,Bedenac,17,,,17038000AW0115,,,,,,,,,,,,,0,,,,,BT,taillis simples,,,5585,-0.314452,45.167298
2020-219686,2020-05-12,000001,Vente,70000,,,COMBES NORD,B041,17210,17038,Bedenac,17,,,17038000AX0026,,,,,,,,,,,,,0,,,,,BR,futaies résineuses,,,2276,-0.325427,45.17111
2020-219686,2020-05-12,000001,Vente,70000,,,COMBES NORD,B041,17210,17038,Bedenac,17,,,17038000AX0027,,,,,,,,,,,,,0,,,,,BR,futaies résineuses,,,12161,-0.325311,45.172078
2020-219686,2020-05-12,000001,Vente,70000,,,COMBES NORD,B041,17210,17038,Bedenac,17,,,17038000AX0028,,,,,,,,,,,,,0,,,,,BR,futaies résineuses,,,51723,-0.323058,45.171553
2020-219686,2020-05-12,000001,Vente,70000,,,COMBES NORD,B041,17210,17038,Bedenac,17,,,17038000AX0034,,,,,,,,,,,,,0,,,,,B,bois,,,2321,-0.322234,45.168386
2020-219686,2020-05-12,000001,Vente,70000,,,COMBES NORD,B041,17210,17038,Bedenac,17,,,17038000AX0035,,,,,,,,,,,,,0,,,,,BR,futaies résineuses,,,27337,-0.322899,45.16896
2020-219686,2020-05-12,000001,Vente,70000,,,COMBES NORD,B041,17210,17038,Bedenac,17,,,17038000AX0036,,,,,,,,,,,,,0,,,,,BR,futaies résineuses,,,56747,-0.325491,45.169507
2020-219717,2020-06-10,000001,Vente,26000,5237,,CHIERZAC EST,B038,17210,17038,Bedenac,17,,,17038000ZB0035,,,,,,,,,,,,,0,1,Maison,65,4,S,sols,,,500,-0.298145,45.207342
2020-219717,2020-06-10,000001,Vente,26000,5237,,CHIERZAC EST,B038,17210,17038,Bedenac,17,,,17038000ZB0035,,,,,,,,,,,,,0,1,Maison,65,4,AG,terrains d'agrément,,,820,-0.298145,45.207342
2020-219719,2020-06-03,000001,Vente,70940,5027,,LE BOURG,B026,17210,17038,Bedenac,17,,,17038000AP0334,,,,,,,,,,,,,0,1,Maison,40,1,S,sols,,,502,-0.301802,45.165954
2020-219819,2020-06-12,000001,Vente,1100,,,LANDE A DURET,B078,17210,17038,Bedenac,17,,,17038000AB0173,,,,,,,,,,,,,0,,,,,B,bois,,,3061,-0.301356,45.213136
2020-219880,2020-06-19,000002,Vente,25000,,,LE BOURG,B026,17210,17038,Bedenac,17,,,17038000AP0329,,,,,,,,,,,,,0,,,,,P,prés,,,609,-0.303645,45.167576
2020-219979,2020-07-06,000001,Vente,435,,,LE GRAND BARAIL,B060,17210,17038,Bedenac,17,,,17038000AR0358,,,,,,,,,,,,,0,,,,,S,sols,,,29,-0.303651,45.170323
2020-220141,2020-08-20,000003,Vente,15000,,,CHIERZAC OUEST,B039,17210,17038,Bedenac,17,,,17038000BP0374,,,,,,,,,,,,,0,,,,,S,sols,,,367,-0.300622,45.205733
2020-220141,2020-08-20,000003,Vente,15000,,,CHIERZAC OUEST,B039,17210,17038,Bedenac,17,,,17038000BP0375,,,,,,,,,,,,,0,,,,,S,sols,,,205,-0.301355,45.205572
2020-220141,2020-08-20,000003,Vente,15000,,,CHIERZAC OUEST,B039,17210,17038,Bedenac,17,,,17038000BP0378,,,,,,,,,,,,,0,,,,,J,jardins,,,555,-0.30093,45.205625
2020-220266,2020-09-25,000001,Vente,43500,,,CHIERZAC OUEST,B039,17210,17038,Bedenac,17,,,17038000BP0120,,,,,,,,,,,,,0,,,,,P,prés,,,5395,-0.300906,45.206298
2020-220266,2020-09-25,000001,Vente,43500,,,CHIERZAC OUEST,B039,17210,17038,Bedenac,17,,,17038000BP0121,,,,,,,,,,,,,0,,,,,P,prés,,,3430,-0.301521,45.206446
2020-220266,2020-09-25,000001,Vente,43500,,,CHIERZAC OUEST,B039,17210,17038,Bedenac,17,,,17038000BP0340,,,,,,,,,,,,,0,,,,,P,prés,,,3921,-0.300378,45.206561
2020-220266,2020-09-25,000001,Vente,43500,,,CHIERZAC OUEST,B039,17210,17038,Bedenac,17,,,17038000BP0373,,,,,,,,,,,,,0,,,,,S,sols,,,1691,,
2020-220411,2020-09-30,000001,Echange,100000,,,TERRIER DE PIERRE FOLLE,B159,17210,17038,Bedenac,17,,,17038000BN0003,,,,,,,,,,,,,0,,,,,B,bois,,,2901,-0.319876,45.197539
2020-220411,2020-09-30,000001,Echange,100000,,,LE MOULIN NEUF,B101,17210,17038,Bedenac,17,,,17038000BN0092,,,,,,,,,,,,,0,,,,,B,bois,,,10880,-0.318839,45.194592
2020-220411,2020-09-30,000001,Echange,100000,,,LE MOULIN NEUF,B101,17210,17038,Bedenac,17,,,17038000BN0093,,,,,,,,,,,,,0,,,,,B,bois,,,12050,-0.31884,45.193545
2020-220411,2020-09-30,000001,Echange,100000,,,LE MOULIN NEUF,B101,17210,17038,Bedenac,17,,,17038000BN0094,,,,,,,,,,,,,0,,,,,BT,taillis simples,,,30020,-0.319729,45.194981
2020-220411,2020-09-30,000001,Echange,100000,9110,F,TERRIER DE PIERRE FOLLE,B159,17210,17038,Bedenac,17,,,17038000BN0110,,,,,,,,,,,,,0,4,Local industriel. commercial ou assimilé,,0,T,terres,,,27735,-0.322921,45.19585
2020-220411,2020-09-30,000001,Echange,100000,,,LE MOULIN NEUF,B101,17210,17038,Bedenac,17,,,17038000BN0112,,,,,,,,,,,,,0,,,,,BT,taillis simples,,,50970,-0.321799,45.194258
2020-220411,2020-09-30,000001,Echange,100000,,,LE MOULIN NEUF,B101,17210,17038,Bedenac,17,,,17038000BN0114,,,,,,,,,,,,,0,,,,,L,landes,FRICH,Friche,24584,-0.324546,45.195289
2020-220411,2020-09-30,000001,Echange,100000,,,LE MOULIN NEUF,B101,17210,17038,Bedenac,17,,,17038000BN0116,,,,,,,,,,,,,0,,,,,S,sols,,,924,-0.326738,45.195485
2020-220411,2020-09-30,000001,Echange,100000,,,TERRIER DE PIERRE FOLLE,B159,17210,17038,Bedenac,17,,,17038000BN0173,,,,,,,,,,,,,0,,,,,B,bois,,,97455,-0.323034,45.196545
2020-220411,2020-09-30,000001,Echange,100000,,,TERRIER DE PIERRE FOLLE,B159,17210,17038,Bedenac,17,,,17038000ZC0053,,,,,,,,,,,,,0,,,,,T,terres,,,6014,-0.319421,45.195891
2020-220661,2020-11-24,000001,Vente,37000,,,CHIERZAC OUEST,B039,17210,17038,Bedenac,17,,,17038000BP0376,,,,,,,,,,,,,0,,,,,S,sols,,,105,-0.301306,45.205506
2020-220661,2020-11-24,000001,Vente,37000,,,CHIERZAC OUEST,B039,17210,17038,Bedenac,17,,,17038000BP0379,,,,,,,,,,,,,0,,,,,S,sols,,,685,-0.300932,45.205523
2020-220661,2020-11-24,000001,Vente,37000,,,CHIERZAC OUEST,B039,17210,17038,Bedenac,17,,,17038000BP0380,,,,,,,,,,,,,0,,,,,S,sols,,,830,-0.300861,45.205351
2020-220661,2020-11-24,000001,Vente,37000,5129,,CHIERZAC OUEST,B039,17210,17038,Bedenac,17,,,17038000BP0381,,,,,,,,,,,,,0,1,Maison,200,12,S,sols,,,217,-0.301255,45.205369
2020-220859,2020-12-18,000001,Vente,10000,,,LE CASSIS,B033,17210,17038,Bedenac,17,,,17038000ZC0009,,,,,,,,,,,,,0,,,,,S,sols,,,1265,-0.304204,45.201193
2020-220859,2020-12-18,000001,Vente,10000,,,LE CASSIS,B033,17210,17038,Bedenac,17,,,17038000ZC0009,,,,,,,,,,,,,0,,,,,CA,carrières,,,20188,-0.304204,45.201193
