id_mutation,date_mutation,numero_disposition,nature_mutation,valeur_fonciere,adresse_numero,adresse_suffixe,adresse_nom_voie,adresse_code_voie,code_postal,code_commune,nom_commune,code_departement,ancien_code_commune,ancien_nom_commune,id_parcelle,ancien_id_parcelle,numero_volume,lot1_numero,lot1_surface_carrez,lot2_numero,lot2_surface_carrez,lot3_numero,lot3_surface_carrez,lot4_numero,lot4_surface_carrez,lot5_numero,lot5_surface_carrez,nombre_lots,code_type_local,type_local,surface_reelle_bati,nombre_pieces_principales,code_nature_culture,nature_culture,code_nature_culture_speciale,nature_culture_speciale,surface_terrain,longitude,latitude
2020-219158,2020-01-11,000001,Echange,500,,,LE PETIT MIRAMBEAU,B142,17270,17077,Cercoux,17,,,17077000BP0072,,,,,,,,,,,,,0,,,,,B,bois,,,1163,-0.216032,45.11746
2020-219158,2020-01-11,000001,Echange,500,,,CHAMAILLARD,B036,17270,17077,Cercoux,17,,,17077000BP0182,,,,,,,,,,,,,0,,,,,B,bois,,,2036,-0.214455,45.114619
2020-219158,2020-01-11,000001,Echange,500,,,CHAMAILLARD,B036,17270,17077,Cercoux,17,,,17077000BP0206,,,,,,,,,,,,,0,,,,,B,bois,,,1461,-0.215544,45.114062
2020-219158,2020-01-11,000001,Echange,500,,,LA PALISSE NOUVELLE,B129,17270,17077,Cercoux,17,,,17077000BP0300,,,,,,,,,,,,,0,,,,,B,bois,,,1258,-0.215498,45.118985
2020-219158,2020-01-11,000001,Echange,500,,,LA FOND DE L ABIME,B059,17270,17077,Cercoux,17,,,17077000BT0050,,,,,,,,,,,,,0,,,,,B,bois,,,2781,-0.237443,45.124167
2020-219158,2020-01-11,000002,Echange,500,,,LES BREJAUDS,B030,17270,17077,Cercoux,17,,,17077000BP0331,,,,,,,,,,,,,0,,,,,B,bois,,,1356,-0.218678,45.120016
2020-219158,2020-01-11,000002,Echange,500,,,LES BREJAUDS,B030,17270,17077,Cercoux,17,,,17077000BP0333,,,,,,,,,,,,,0,,,,,B,bois,,,3400,-0.218914,45.120203
2020-219158,2020-01-11,000002,Echange,500,,,LES BREJAUDS,B030,17270,17077,Cercoux,17,,,17077000BP0346,,,,,,,,,,,,,0,,,,,B,bois,,,1519,-0.220158,45.120501
2020-219158,2020-01-11,000002,Echange,500,,,LES BREJAUDS,B030,17270,17077,Cercoux,17,,,17077000BP0349,,,,,,,,,,,,,0,,,,,BP,peupleraies,,,1247,-0.22077,45.119896
2020-219182,2020-01-27,000001,Vente,42000,5303,,QUILLET,B163,17270,17077,Cercoux,17,,,17077000AR0241,,,,,,,,,,,,,0,1,Maison,50,2,S,sols,,,1735,-0.186954,45.14263
2020-219182,2020-01-27,000001,Vente,42000,,,QUILLET,B163,17270,17077,Cercoux,17,,,17077000AR0242,,,,,,,,,,,,,0,,,,,T,terres,,,7820,-0.18769,45.142349
2020-219274,2020-02-18,000001,Vente,30000,5142,,MIRAMBEAU,B112,17270,17077,Cercoux,17,,,17077000BM0356,,,,,,,,,,,,,0,1,Maison,112,3,S,sols,,,1760,-0.208274,45.11643
2020-219330,2020-02-06,000001,Vente,3000,,,MOREAU,B115,17270,17077,Cercoux,17,,,17077000AS0076,,,,,,,,,,,,,0,,,,,T,terres,,,800,-0.189839,45.140592
2020-219330,2020-02-06,000001,Vente,3000,,,MOREAU,B115,17270,17077,Cercoux,17,,,17077000AS0076,,,,,,,,,,,,,0,,,,,VI,vignes,,,8253,-0.189839,45.140592
2020-219374,2020-02-19,000001,Vente,170000,,,RIPOUSSEAU,B168,17270,17077,Cercoux,17,,,17077000BL0231,,,,,,,,,,,,,0,,,,,T,terres,,,1945,-0.1969,45.116611
2020-219374,2020-02-19,000001,Vente,170000,,,RIPOUSSEAU,B168,17270,17077,Cercoux,17,,,17077000BL0232,,,,,,,,,,,,,0,,,,,BT,taillis simples,,,483,-0.196741,45.116979
2020-219374,2020-02-19,000001,Vente,170000,,,RIPOUSSEAU,B168,17270,17077,Cercoux,17,,,17077000BL0233,,,,,,,,,,,,,0,,,,,T,terres,,,1077,-0.19666,45.116416
2020-219374,2020-02-19,000001,Vente,170000,,,RIPOUSSEAU,B168,17270,17077,Cercoux,17,,,17077000BL0234,,,,,,,,,,,,,0,,,,,T,terres,,,1023,-0.196504,45.116789
2020-219374,2020-02-19,000001,Vente,170000,,,RIPOUSSEAU,B168,17270,17077,Cercoux,17,,,17077000BL0234,,,,,,,,,,,,,0,,,,,L,landes,,,2289,-0.196504,45.116789
2020-219374,2020-02-19,000001,Vente,170000,,,RIPOUSSEAU,B168,17270,17077,Cercoux,17,,,17077000BL0405,,,,,,,,,,,,,0,,,,,T,terres,,,9000,-0.196402,45.115951
2020-219374,2020-02-19,000001,Vente,170000,5540,,RIPOUSSEAU,B168,17270,17077,Cercoux,17,,,17077000BL0439,,,,,,,,,,,,,0,1,Maison,100,5,S,sols,,,500,-0.19412,45.116301
2020-219374,2020-02-19,000001,Vente,170000,5540,,RIPOUSSEAU,B168,17270,17077,Cercoux,17,,,17077000BL0439,,,,,,,,,,,,,0,1,Maison,100,5,P,prés,,,1325,-0.19412,45.116301
2020-219374,2020-02-19,000001,Vente,170000,,,RIPOUSSEAU,B168,17270,17077,Cercoux,17,,,17077000BL0441,,,,,,,,,,,,,0,,,,,T,terres,,,5,-0.194624,45.11638
2020-219374,2020-02-19,000001,Vente,170000,,,RIPOUSSEAU,B168,17270,17077,Cercoux,17,,,17077000BL0442,,,,,,,,,,,,,0,,,,,T,terres,,,2285,-0.19559,45.116046
2020-219374,2020-02-19,000001,Vente,170000,,,RIPOUSSEAU,B168,17270,17077,Cercoux,17,,,17077000BL0444,,,,,,,,,,,,,0,,,,,P,prés,,,215,-0.194326,45.11641
2020-219374,2020-02-19,000001,Vente,170000,,,RIPOUSSEAU,B168,17270,17077,Cercoux,17,,,17077000BL0449,,,,,,,,,,,,,0,,,,,T,terres,,,12876,-0.195145,45.115709
2020-219402,2020-03-16,000001,Vente,151000,,,LA METAIRIE,B111,17270,17077,Cercoux,17,,,17077000BO0423,,,,,,,,,,,,,0,,,,,S,sols,,,102,-0.211504,45.129699
2020-219402,2020-03-16,000001,Vente,151000,5067,,LA METAIRIE,B111,17270,17077,Cercoux,17,,,17077000BO0424,,,,,,,,,,,,,0,1,Maison,155,6,S,sols,,,727,-0.211375,45.129722
2020-219410,2020-03-06,000001,Vente,8000,,,LA CHAUME DES LANDES,B041,17270,17077,Cercoux,17,,,17077000BO0318,,,,,,,,,,,,,0,,,,,T,terres,,,6843,-0.216986,45.125439
2020-219410,2020-03-06,000001,Vente,8000,,,LA CHAUME DES LANDES,B041,17270,17077,Cercoux,17,,,17077000BO0319,,,,,,,,,,,,,0,,,,,T,terres,,,6725,-0.216402,45.125699
2020-219410,2020-03-06,000001,Vente,8000,,,LA CHAUME DES LANDES,B041,17270,17077,Cercoux,17,,,17077000BO0397,,,,,,,,,,,,,0,,,,,T,terres,,,3667,-0.215355,45.12549
2020-219410,2020-03-06,000001,Vente,8000,,,LA CHAUME DES LANDES,B041,17270,17077,Cercoux,17,,,17077000BO0399,,,,,,,,,,,,,0,,,,,P,prés,,,1180,-0.215879,45.124921
2020-219410,2020-03-06,000001,Vente,8000,,,LA CHAUME DES LANDES,B041,17270,17077,Cercoux,17,,,17077000BO0401,,,,,,,,,,,,,0,,,,,P,prés,,,1462,-0.21648,45.124677
2020-219433,2020-02-25,000001,Vente,100000,,,PRE DU CHATAIGNIER,B156,17270,17077,Cercoux,17,,,17077000BL0015,,,,,,,,,,,,,0,,,,,P,prés,,,3350,-0.212115,45.111247
2020-219433,2020-02-25,000001,Vente,100000,,,PAS DE LAVERGNE,B132,17270,17077,Cercoux,17,,,17077000BL0336,,,,,,,,,,,,,0,,,,,P,prés,,,2630,-0.204607,45.105982
2020-219433,2020-02-25,000001,Vente,100000,,,LE SENAT,B174,17270,17077,Cercoux,17,,,17077000BP0226,,,,,,,,,,,,,0,,,,,B,bois,,,2670,-0.218976,45.112716
2020-219433,2020-02-25,000001,Vente,100000,,,POCHUT,B148,17270,17077,Cercoux,17,,,17077000BR0091,,,,,,,,,,,,,0,,,,,BT,taillis simples,,,2290,-0.217963,45.108457
2020-219433,2020-02-25,000001,Vente,100000,,,POCHUT,B148,17270,17077,Cercoux,17,,,17077000BR0130,,,,,,,,,,,,,0,,,,,B,bois,,,824,-0.216296,45.110895
2020-219433,2020-02-25,000001,Vente,100000,,,POCHUT,B148,17270,17077,Cercoux,17,,,17077000BR0131,,,,,,,,,,,,,0,,,,,B,bois,,,573,-0.216216,45.110967
2020-219433,2020-02-25,000001,Vente,100000,5170,,POCHUT,B148,17270,17077,Cercoux,17,,,17077000BR0132,,,,,,,,,,,,,0,1,Maison,82,5,S,sols,,,743,-0.215984,45.110791
2020-219433,2020-02-25,000001,Vente,100000,,,LE PAS DU CANON,B136,17270,17077,Cercoux,17,,,17077000BR0227,,,,,,,,,,,,,0,,,,,L,landes,,,2978,-0.212011,45.105631
2020-219433,2020-02-25,000001,Vente,100000,,,LE PAS DU CANON,B136,17270,17077,Cercoux,17,,,17077000BR0276,,,,,,,,,,,,,0,,,,,BT,taillis simples,,,2295,-0.209152,45.101363
2020-219433,2020-02-25,000001,Vente,100000,,,LE PAS DU CANON,B136,17270,17077,Cercoux,17,,,17077000BR0286,,,,,,,,,,,,,0,,,,,P,prés,,,1345,-0.209728,45.100733
2020-219433,2020-02-25,000001,Vente,100000,,,POCHUT,B148,17270,17077,Cercoux,17,,,17077000BR0314,,,,,,,,,,,,,0,,,,,B,bois,,,1313,-0.216516,45.110824
2020-219445,2020-02-28,000001,Vente,36000,,,LE MOULIN NEUF,B121,17270,17077,Cercoux,17,,,17077000AT0322,,,,,,,,,,,,,0,,,,,S,sols,,,500,-0.167624,45.14018
2020-219445,2020-02-28,000001,Vente,36000,,,LE MOULIN NEUF,B121,17270,17077,Cercoux,17,,,17077000AT0322,,,,,,,,,,,,,0,,,,,J,jardins,,,1627,-0.167624,45.14018
2020-219498,2020-02-19,000001,Echange,700,,,LA GARENNE,B070,17270,17077,Cercoux,17,,,17077000BI0209,,,,,,,,,,,,,0,,,,,L,landes,,,2921,-0.180767,45.097638
2020-219498,2020-02-19,000001,Echange,700,,,LA GARENNE,B070,17270,17077,Cercoux,17,,,17077000BI0215,,,,,,,,,,,,,0,,,,,L,landes,,,182,-0.180787,45.095103
2020-219498,2020-02-19,000001,Echange,700,,,LA GARENNE,B070,17270,17077,Cercoux,17,,,17077000BI0218,,,,,,,,,,,,,0,,,,,L,landes,,,434,-0.180916,45.095243
2020-219498,2020-02-19,000002,Echange,700,,,LE GAUTREAU,B072,17270,17077,Cercoux,17,,,17077000BH0073,,,,,,,,,,,,,0,,,,,L,landes,,,2112,-0.166828,45.094178
2020-219498,2020-02-19,000002,Echange,700,,,LE GAUTREAU,B072,17270,17077,Cercoux,17,,,17077000BH0074,,,,,,,,,,,,,0,,,,,B,bois,,,4020,-0.166946,45.094473
2020-219535,2020-04-21,000001,Vente,1000,,,BOIS DES COMBES,B023,17270,17077,Cercoux,17,,,17077000AZ0046,,,,,,,,,,,,,0,,,,,B,bois,,,7445,-0.183678,45.12108
2020-219539,2020-02-18,000001,Vente,3360,,,LEVRAULT,B097,17270,17077,Cercoux,17,,,17077000AB0053,,,,,,,,,,,,,0,,,,,L,landes,,,35355,-0.245437,45.133702
2020-219559,2020-04-23,000001,Vente,500,,,LE PETIT MIRAMBEAU,B142,17270,17077,Cercoux,17,,,17077000BP0055,,,,,,,,,,,,,0,,,,,B,bois,,,2316,-0.21323,45.119954
2020-219603,2020-04-30,000001,Vente,3000,,,BARDON NORD,B008,17270,17077,Cercoux,17,,,17077000AN0001,,,,,,,,,,,,,0,,,,,P,prés,,,4194,-0.202386,45.146439
2020-219605,2020-05-04,000002,Echange,500,,,PAS DE JEAN BLANC,B131,17270,17077,Cercoux,17,,,17077000AK0315,,,,,,,,,,,,,0,,,,,T,terres,,,406,-0.223681,45.14922
2020-219627,2020-05-04,000001,Vente,130000,5208,,PAS DE JEAN BLANC,B131,17270,17077,Cercoux,17,,,17077000AK0034,,,,,,,,,,,,,0,1,Maison,111,3,S,sols,,,1015,-0.224309,45.149246
2020-219627,2020-05-04,000001,Vente,130000,,,PAS DE JEAN BLANC,B131,17270,17077,Cercoux,17,,,17077000AK0035,,,,,,,,,,,,,0,,,,,J,jardins,,,580,-0.22462,45.149052
2020-219627,2020-05-04,000001,Vente,130000,,,PAS DE JEAN BLANC,B131,17270,17077,Cercoux,17,,,17077000AK0036,,,,,,,,,,,,,0,,,,,L,landes,,,1466,-0.224862,45.149133
2020-219627,2020-05-04,000001,Vente,130000,,,PAS DE JEAN BLANC,B131,17270,17077,Cercoux,17,,,17077000AK0296,,,,,,,,,,,,,0,,,,,P,prés,,,1783,-0.224131,45.149065
2020-219627,2020-05-04,000001,Vente,130000,,,PAS DE JEAN BLANC,B131,17270,17077,Cercoux,17,,,17077000AK0314,,,,,,,,,,,,,0,,,,,T,terres,,,1656,-0.223993,45.149251
2020-219635,2020-05-18,000001,Vente,2100,,,LA FONT DU CUL,B063,17270,17077,Cercoux,17,,,17077000BW0005,,,,,,,,,,,,,0,,,,,L,landes,,,13680,-0.255727,45.115991
2020-219741,2020-06-05,000001,Vente,125000,5571,,VALIN,B180,17270,17077,Cercoux,17,,,17077000AV0473,,,,,,,,,,,,,0,1,Maison,88,5,AG,terrains d'agrément,,,1105,-0.166347,45.13975
2020-219741,2020-06-05,000001,Vente,125000,5571,,VALIN,B180,17270,17077,Cercoux,17,,,17077000AV0473,,,,,,,,,,,,,0,1,Maison,88,5,S,sols,,,500,-0.166347,45.13975
2020-219789,2020-06-09,000001,Vente,86400,5354,A,VALIN,B180,17270,17077,Cercoux,17,,,17077000AV0027,,,,,,,,,,,,,0,1,Maison,113,4,S,sols,,,823,-0.163441,45.140463
2020-219871,2020-07-10,000001,Vente,50000,,,VALIN,B180,17270,17077,Cercoux,17,,,17077000AV0042,,,,,,,,,,,,,0,,,,,J,jardins,,,426,-0.16379,45.140324
2020-219871,2020-07-10,000001,Vente,50000,,,VALIN,B180,17270,17077,Cercoux,17,,,17077000AV0043,,,,,,,,,,,,,0,,,,,J,jardins,,,133,-0.163768,45.140419
2020-219871,2020-07-10,000001,Vente,50000,5341,,VALIN,B180,17270,17077,Cercoux,17,,,17077000AV0044,,,,,,,,,,,,,0,1,Maison,97,4,S,sols,,,330,-0.163664,45.139981
2020-219871,2020-07-10,000001,Vente,50000,,,VALIN,B180,17270,17077,Cercoux,17,,,17077000AV0444,,,,,,,,,,,,,0,,,,,S,sols,,,587,-0.163808,45.140102
2020-219972,2020-07-29,000001,Vente,179000,,,PRAIRIE DE MUSSEAU,B155,17270,17077,Cercoux,17,,,17077000AZ0221,,,,,,,,,,,,,0,,,,,P,prés,,,7682,-0.170249,45.124155
2020-219972,2020-07-29,000001,Vente,179000,5390,,PRAIRIE DE MUSSEAU,B155,17270,17077,Cercoux,17,,,17077000AZ0222,,,,,,,,,,,,,0,1,Maison,88,3,S,sols,,,2074,-0.170435,45.125032
2020-219972,2020-07-29,000001,Vente,179000,,,EBAUNY,B053,17270,17077,Cercoux,17,,,17077000AZ0228,,,,,,,,,,,,,0,,,,,BT,taillis simples,,,143,-0.170714,45.123776
2020-219972,2020-07-29,000001,Vente,179000,,,PRAIRIE DE MUSSEAU,B155,17270,17077,Cercoux,17,,,17077000AZ0529,,,,,,,,,,,,,0,,,,,P,prés,,,17360,-0.171641,45.124158
2020-219981,2020-07-17,000001,Vente,500,,,LA MAISON NEUVE EST,B104,17270,17077,Cercoux,17,,,17077000AK0001,,,,,,,,,,,,,0,,,,,J,jardins,,,525,-0.230796,45.148718
2020-219981,2020-07-17,000001,Vente,500,,,LA MAISON NEUVE EST,B104,17270,17077,Cercoux,17,,,17077000AK0013,,,,,,,,,,,,,0,,,,,P,prés,,,4205,-0.228892,45.149302
2020-219996,2020-07-21,000001,Vente,3200,,,COMBE DU CHAT HUANT,B045,17270,17077,Cercoux,17,,,17077000AD0118,,,,,,,,,,,,,0,,,,,B,bois,,,1737,-0.232278,45.139561
2020-219996,2020-07-21,000001,Vente,3200,,,COMBE DU CHAT HUANT,B045,17270,17077,Cercoux,17,,,17077000AD0120,,,,,,,,,,,,,0,,,,,B,bois,,,831,-0.232665,45.139311
2020-219996,2020-07-21,000001,Vente,3200,,,LUTARD NORD,B101,17270,17077,Cercoux,17,,,17077000AD0121,,,,,,,,,,,,,0,,,,,B,bois,,,2495,-0.232408,45.138869
2020-219996,2020-07-21,000001,Vente,3200,,,LUTARD NORD,B101,17270,17077,Cercoux,17,,,17077000AD0126,,,,,,,,,,,,,0,,,,,B,bois,,,7728,-0.233029,45.138089
2020-219996,2020-07-21,000001,Vente,3200,,,LUTARD NORD,B101,17270,17077,Cercoux,17,,,17077000AD0133,,,,,,,,,,,,,0,,,,,B,bois,,,6000,-0.230868,45.138169
2020-219996,2020-07-21,000001,Vente,3200,,,LUTARD NORD,B101,17270,17077,Cercoux,17,,,17077000AD0133,,,,,,,,,,,,,0,,,,,B,bois,,,8799,-0.230868,45.138169
2020-219996,2020-07-21,000001,Vente,3200,,,LUTARD NORD,B101,17270,17077,Cercoux,17,,,17077000AD0138,,,,,,,,,,,,,0,,,,,B,bois,,,2948,-0.228948,45.138543
2020-219996,2020-07-21,000001,Vente,3200,,,LUTARD NORD,B101,17270,17077,Cercoux,17,,,17077000AD0140,,,,,,,,,,,,,0,,,,,B,bois,,,3203,-0.226897,45.138551
2020-220023,2020-07-31,000001,Vente,242500,26,,LA CHAUME DES LANDES,B041,17270,17077,Cercoux,17,,,17077000BO0414,,,,,,,,,,,,,0,1,Maison,130,5,AG,terrains d'agrément,,,1006,-0.211921,45.127471
2020-220023,2020-07-31,000001,Vente,242500,26,,LA CHAUME DES LANDES,B041,17270,17077,Cercoux,17,,,17077000BO0414,,,,,,,,,,,,,0,1,Maison,130,5,S,sols,,,500,-0.211921,45.127471
2020-220023,2020-07-31,000001,Vente,242500,,,LA METAIRIE,B111,17270,17077,Cercoux,17,,,17077000BO0417,,,,,,,,,,,,,0,,,,,S,sols,,,47,-0.2117,45.127285
2020-220095,2020-08-13,000001,Vente,99000,,,MIRAMBEAU,B112,17270,17077,Cercoux,17,,,17077000BM0360,,,,,,,,,,,,,0,,,,,J,jardins,,,570,-0.208601,45.116903
2020-220095,2020-08-13,000001,Vente,99000,,,MIRAMBEAU,B112,17270,17077,Cercoux,17,,,17077000BM0428,,,,,,,,,,,,,0,,,,,S,sols,,,26,-0.208608,45.116961
2020-220095,2020-08-13,000001,Vente,99000,5143,,MIRAMBEAU,B112,17270,17077,Cercoux,17,,,17077000BM0470,,,,,,,,,,,,,0,1,Maison,50,2,S,sols,,,171,-0.208385,45.116809
2020-220095,2020-08-13,000001,Vente,99000,,,MIRAMBEAU,B112,17270,17077,Cercoux,17,,,17077000BM0491,,,,,,,,,,,,,0,,,,,P,prés,,,545,-0.208639,45.116706
2020-220126,2020-08-26,000001,Vente,55000,5425,,RONDEAU NORD,B170,17270,17077,Cercoux,17,,,17077000BK0235,,,,,,,,,,,,,0,1,Maison,35,1,S,sols,,,1034,-0.192163,45.10468
2020-220126,2020-08-26,000001,Vente,55000,,,RONDEAU NORD,B170,17270,17077,Cercoux,17,,,17077000BK0236,,,,,,,,,,,,,0,,,,,P,prés,,,1893,-0.19247,45.104685
2020-220126,2020-08-26,000001,Vente,55000,,,RONDEAU NORD,B170,17270,17077,Cercoux,17,,,17077000BK0398,,,,,,,,,,,,,0,,,,,T,terres,,,254,-0.192162,45.104867
2020-220136,2020-08-31,000001,Vente,178000,5551,,COULEAU,B051,17270,17077,Cercoux,17,,,17077000BS0278,,,,,,,,,,,,,0,1,Maison,140,6,S,sols,,,500,-0.226952,45.115426
2020-220136,2020-08-31,000001,Vente,178000,5551,,COULEAU,B051,17270,17077,Cercoux,17,,,17077000BS0278,,,,,,,,,,,,,0,1,Maison,140,6,AG,terrains d'agrément,,,3119,-0.226952,45.115426
2020-220136,2020-08-31,000001,Vente,178000,,,COULEAU,B051,17270,17077,Cercoux,17,,,17077000BS0279,,,,,,,,,,,,,0,,,,,P,prés,,,984,-0.22715,45.115163
2020-220168,2020-09-04,000001,Vente,48634.42,,,BARAIL DE MANON,B005,17270,17077,Cercoux,17,,,17077000AN0326,,,,,,,,,,,,,0,,,,,P,prés,,,5620,-0.20031,45.158127
2020-220168,2020-09-04,000001,Vente,48634.42,,,BARAIL DE MANON,B005,17270,17077,Cercoux,17,,,17077000AN0327,,,,,,,,,,,,,0,,,,,BT,taillis simples,,,717,-0.199999,45.158009
2020-220168,2020-09-04,000001,Vente,48634.42,,,LE PONT DE SAUZEAU,B149,17270,17077,Cercoux,17,,,17077000AP0079,,,,,,,,,,,,,0,,,,,L,landes,,,700,-0.184714,45.155444
2020-220168,2020-09-04,000001,Vente,48634.42,,,LE PONT DE SAUZEAU,B149,17270,17077,Cercoux,17,,,17077000AP0084,,,,,,,,,,,,,0,,,,,L,landes,,,914,-0.184463,45.155148
2020-220168,2020-09-04,000001,Vente,48634.42,,,LE PONT DE SAUZEAU,B149,17270,17077,Cercoux,17,,,17077000AP0089,,,,,,,,,,,,,0,,,,,L,landes,,,394,-0.184471,45.15489
2020-220168,2020-09-04,000001,Vente,48634.42,,,LES ABELINS,B001,17270,17077,Cercoux,17,,,17077000BY0003,,,,,,,,,,,,,0,,,,,B,bois,,,2340,-0.274174,45.139128
2020-220168,2020-09-04,000001,Vente,48634.42,,,LES ABELINS,B001,17270,17077,Cercoux,17,,,17077000BY0004,,,,,,,,,,,,,0,,,,,B,bois,,,12240,-0.274454,45.13919
2020-220168,2020-09-04,000001,Vente,48634.42,,,LA TERRE NEGRE,B175,17270,17077,Cercoux,17,,,17077000BY0005,,,,,,,,,,,,,0,,,,,B,bois,,,1793,-0.27377,45.139266
2020-220168,2020-09-04,000001,Vente,48634.42,,,LA TERRE NEGRE,B175,17270,17077,Cercoux,17,,,17077000BY0011,,,,,,,,,,,,,0,,,,,B,bois,,,6032,-0.272459,45.138158
2020-220168,2020-09-04,000001,Vente,48634.42,,,LES JAPPES LOUPS,B087,17270,17077,Cercoux,17,,,17077000BY0099,,,,,,,,,,,,,0,,,,,B,bois,,,2733,-0.273467,45.138255
2020-220226,2020-08-24,000001,Vente,2612.5,,,FURET SUD,B069,17270,17077,Cercoux,17,,,17077000BK0119,,,,,,,,,,,,,0,,,,,B,bois,,,5193,-0.196993,45.106151
2020-220226,2020-08-24,000001,Vente,2612.5,,,FURET SUD,B069,17270,17077,Cercoux,17,,,17077000BK0126,,,,,,,,,,,,,0,,,,,B,bois,,,1258,-0.198629,45.106623
2020-220226,2020-08-24,000001,Vente,2612.5,,,FURET SUD,B069,17270,17077,Cercoux,17,,,17077000BK0128,,,,,,,,,,,,,0,,,,,B,bois,,,5877,-0.199215,45.107299
2020-220229,2020-08-24,000002,Vente,45000,5168,,POCHUT,B148,17270,17077,Cercoux,17,,,17077000BR0139,,,,,,,,,,,,,0,1,Maison,91,4,S,sols,,,1320,-0.214874,45.109603
2020-220229,2020-08-24,000002,Vente,45000,,,POCHUT,B148,17270,17077,Cercoux,17,,,17077000BR0140,,,,,,,,,,,,,0,,,,,P,prés,,,810,-0.214679,45.110004
2020-220229,2020-08-24,000002,Vente,45000,,,POCHUT,B148,17270,17077,Cercoux,17,,,17077000BR0141,,,,,,,,,,,,,0,,,,,P,prés,,,1195,-0.214426,45.110089
2020-220229,2020-08-24,000002,Vente,45000,,,POCHUT,B148,17270,17077,Cercoux,17,,,17077000BR0142,,,,,,,,,,,,,0,,,,,P,prés,,,820,-0.214252,45.109949
2020-220229,2020-08-24,000002,Vente,45000,,,POCHUT,B148,17270,17077,Cercoux,17,,,17077000BR0143,,,,,,,,,,,,,0,,,,,T,terres,,,198,-0.214126,45.109901
2020-220229,2020-08-24,000002,Vente,45000,,,POCHUT,B148,17270,17077,Cercoux,17,,,17077000BR0144,,,,,,,,,,,,,0,,,,,P,prés,,,583,-0.214029,45.109939
2020-220229,2020-08-24,000002,Vente,45000,,,POCHUT,B148,17270,17077,Cercoux,17,,,17077000BR0184,,,,,,,,,,,,,0,,,,,T,terres,,,5415,-0.214548,45.10936
2020-220229,2020-08-24,000002,Vente,45000,,,POCHUT,B148,17270,17077,Cercoux,17,,,17077000BR0365,,,,,,,,,,,,,0,,,,,P,prés,,,135,-0.214989,45.109791
2020-220364,2020-09-23,000001,Vente,800,,,POCHUT,B148,17270,17077,Cercoux,17,,,17077000BR0185,,,,,,,,,,,,,0,,,,,T,terres,,,1330,-0.213815,45.108623
2020-220364,2020-09-23,000001,Vente,800,,,POCHUT,B148,17270,17077,Cercoux,17,,,17077000BR0185,,,,,,,,,,,,,0,,,,,L,landes,,,8225,-0.213815,45.108623
2020-220364,2020-09-23,000001,Vente,800,,,POCHUT,B148,17270,17077,Cercoux,17,,,17077000BR0186,,,,,,,,,,,,,0,,,,,T,terres,,,1271,-0.214233,45.108911
2020-220390,2020-09-30,000001,Vente,8500,,,LES POTIERS,B153,17270,17077,Cercoux,17,,,17077000AL0120,,,,,,,,,,,,,0,,,,,L,landes,,,1250,-0.203316,45.148318
2020-220390,2020-09-30,000001,Vente,8500,,,LES POTIERS,B153,17270,17077,Cercoux,17,,,17077000AL0121,,,,,,,,,,,,,0,,,,,P,prés,,,5650,-0.203252,45.147724
2020-220402,2020-10-21,000001,Vente,2250,,,BONNUT,B025,17270,17077,Cercoux,17,,,17077000BL0147,,,,,,,,,,,,,0,,,,,B,bois,,,1180,-0.208847,45.109403
2020-220402,2020-10-21,000001,Vente,2250,,,PAS DE LAVERGNE,B132,17270,17077,Cercoux,17,,,17077000BL0394,,,,,,,,,,,,,0,,,,,B,bois,,,391,-0.207755,45.108814
2020-220402,2020-10-21,000001,Vente,2250,,,PAS DE LAVERGNE,B132,17270,17077,Cercoux,17,,,17077000BL0395,,,,,,,,,,,,,0,,,,,P,prés,,,1469,-0.208004,45.108656
2020-220402,2020-10-21,000001,Vente,2250,,,PAS DE LAVERGNE,B132,17270,17077,Cercoux,17,,,17077000BL0398,,,,,,,,,,,,,0,,,,,P,prés,,,3475,-0.209074,45.109206
2020-220402,2020-10-21,000001,Vente,2250,,,LE PAS DU CANON,B136,17270,17077,Cercoux,17,,,17077000BR0245,,,,,,,,,,,,,0,,,,,BT,taillis simples,,,2305,-0.209623,45.104022
2020-220402,2020-10-21,000001,Vente,2250,,,LE PAS DU CANON,B136,17270,17077,Cercoux,17,,,17077000BR0249,,,,,,,,,,,,,0,,,,,B,bois,,,1661,-0.208251,45.103826
2020-220402,2020-10-21,000001,Vente,2250,,,LE PAS DU CANON,B136,17270,17077,Cercoux,17,,,17077000BR0259,,,,,,,,,,,,,0,,,,,BT,taillis simples,,,2976,-0.208508,45.102719
2020-220402,2020-10-21,000001,Vente,2250,,,LE PAS DU CANON,B136,17270,17077,Cercoux,17,,,17077000BR0277,,,,,,,,,,,,,0,,,,,BT,taillis simples,,,2233,-0.208966,45.101333
2020-220404,2020-10-21,000001,Vente,2500,,,CHAGNAS,B035,17270,17077,Cercoux,17,,,17077000BK0092,,,,,,,,,,,,,0,,,,,T,terres,,,7041,-0.20467,45.102799
2020-220404,2020-10-21,000001,Vente,2500,,,CHAGNAS,B035,17270,17077,Cercoux,17,,,17077000BK0093,,,,,,,,,,,,,0,,,,,BT,taillis simples,,,2492,-0.204442,45.103168
2020-220404,2020-10-21,000001,Vente,2500,,,POCHUT,B148,17270,17077,Cercoux,17,,,17077000BR0320,,,,,,,,,,,,,0,,,,,P,prés,,,14915,-0.210706,45.106616
2020-220404,2020-10-21,000001,Vente,2500,,,PRE DU CHATAIGNIER,B156,17270,17077,Cercoux,17,,,17077000BL0034,,,,,,,,,,,,,0,,,,,B,bois,,,1480,-0.210104,45.109244
2020-220404,2020-10-21,000001,Vente,2500,,,LE PAS DU CANON,B136,17270,17077,Cercoux,17,,,17077000BR0255,,,,,,,,,,,,,0,,,,,B,bois,,,2633,-0.207824,45.102602
2020-220404,2020-10-21,000001,Vente,2500,,,LE PAS DU CANON,B136,17270,17077,Cercoux,17,,,17077000BR0261,,,,,,,,,,,,,0,,,,,B,bois,,,4456,-0.208935,45.102824
2020-220404,2020-10-21,000001,Vente,2500,,,LE PAS DU CANON,B136,17270,17077,Cercoux,17,,,17077000BR0267,,,,,,,,,,,,,0,,,,,B,bois,,,3492,-0.210611,45.103321
2020-220441,2020-10-02,000001,Vente,800,,,BOIS DE LA MERLETTERIE,B022,17270,17077,Cercoux,17,,,17077000BH0013,,,,,,,,,,,,,0,,,,,L,landes,,,2289,-0.176394,45.098514
2020-220441,2020-10-02,000001,Vente,800,,,LA GARENNE,B070,17270,17077,Cercoux,17,,,17077000BI0179,,,,,,,,,,,,,0,,,,,L,landes,,,2472,-0.189487,45.098516
2020-220441,2020-10-02,000001,Vente,800,,,LE SENAT,B174,17270,17077,Cercoux,17,,,17077000BP0271,,,,,,,,,,,,,0,,,,,B,bois,,,1882,-0.218096,45.117352
2020-220480,2020-10-17,000001,Vente,158000,,,GILBERT NORD,B074,17270,17077,Cercoux,17,,,17077000AM0273,,,,,,,,,,,,,0,,,,,S,sols,,,365,-0.204265,45.133774
2020-220480,2020-10-17,000001,Vente,158000,5470,,GILBERT NORD,B074,17270,17077,Cercoux,17,,,17077000AM0278,,,,,,,,,,,,,0,1,Maison,96,4,S,sols,,,626,-0.204186,45.133751
2020-220492,2020-10-19,000001,Vente,19000,,,SAINT NAZAIRE,B172,17270,17077,Cercoux,17,,,17077000BN0357,,,,,,,,,,,,,0,,,,,AB,terrains a bâtir,,,1518,-0.203407,45.126978
2020-220516,2020-11-13,000001,Vente,6000,,,FRICHOU,B067,17270,17077,Cercoux,17,,,17077000AH0042,,,,,,,,,,,,,0,,,,,B,bois,,,41,-0.223567,45.136415
2020-220516,2020-11-13,000001,Vente,6000,,,FRICHOU,B067,17270,17077,Cercoux,17,,,17077000AH0103,,,,,,,,,,,,,0,,,,,B,bois,,,3800,-0.21953,45.137794
2020-220516,2020-11-13,000001,Vente,6000,,,FRICHOU,B067,17270,17077,Cercoux,17,,,17077000AH0104,,,,,,,,,,,,,0,,,,,B,bois,,,570,-0.219569,45.137498
2020-220516,2020-11-13,000001,Vente,6000,,,FAUCHAIN OUEST,B187,17270,17077,Cercoux,17,,,17077000AH0165,,,,,,,,,,,,,0,,,,,T,terres,,,3785,-0.212024,45.136067
2020-220516,2020-11-13,000001,Vente,6000,,,FAUCHAIN OUEST,B187,17270,17077,Cercoux,17,,,17077000AH0166,,,,,,,,,,,,,0,,,,,BT,taillis simples,,,1818,-0.211138,45.135583