id_mutation,date_mutation,numero_disposition,nature_mutation,valeur_fonciere,adresse_numero,adresse_suffixe,adresse_nom_voie,adresse_code_voie,code_postal,code_commune,nom_commune,code_departement,ancien_code_commune,ancien_nom_commune,id_parcelle,ancien_id_parcelle,numero_volume,lot1_numero,lot1_surface_carrez,lot2_numero,lot2_surface_carrez,lot3_numero,lot3_surface_carrez,lot4_numero,lot4_surface_carrez,lot5_numero,lot5_surface_carrez,nombre_lots,code_type_local,type_local,surface_reelle_bati,nombre_pieces_principales,code_nature_culture,nature_culture,code_nature_culture_speciale,nature_culture_speciale,surface_terrain,longitude,latitude
2020-219166,2020-01-07,000001,Vente,39000,,,CHEZ TANCHERAUD SUD,B040,17150,17116,Consac,17,,,17116000ZC0210,,,,,,,,,,,,,0,,,,,VI,vignes,,,3451,-0.578874,45.421238
2020-219166,2020-01-07,000001,Vente,39000,,,CHEZ TANCHERAUD SUD,B040,17150,17116,Consac,17,,,17116000ZC0212,,,,,,,,,,,,,0,,,,,VI,vignes,,,10249,-0.580927,45.420444
2020-219322,2020-02-07,000001,Vente,165000,2,,PETIT TERRIER,B091,17150,17116,Consac,17,,,17116000ZA0079,,,,,,,,,,,,,0,1,Maison,99,4,S,sols,,,500,-0.593184,45.424442
2020-219322,2020-02-07,000001,Vente,165000,2,,PETIT TERRIER,B091,17150,17116,Consac,17,,,17116000ZA0079,,,,,,,,,,,,,0,1,Maison,99,4,T,terres,,,1750,-0.593184,45.424442
2020-219792,2020-06-25,000001,Vente,1500,,,LES MOULURES,B085,17150,17116,Consac,17,,,17116000ZL0029,,,,,,,,,,,,,0,,,,,T,terres,,,2600,-0.607994,45.418729
2020-219844,2020-06-18,000001,Vente,30000,,,LA FRAGNEE,B057,17150,17116,Consac,17,,,17116000AM0015,,,,,,,,,,,,,0,,,,,S,sols,,,375,-0.599025,45.417984
2020-219844,2020-06-18,000001,Vente,30000,8,,LA FRAGNEE,B057,17150,17116,Consac,17,,,17116000AM0212,,,,,,,,,,,,,0,1,Maison,52,1,S,sols,,,459,-0.599079,45.41782
2020-219998,2020-07-24,000001,Vente,500,,,CHEZ YOU,B042,17150,17116,Consac,17,,,17116000ZB0522,,,,,,,,,,,,,0,,,,,BT,taillis simples,,,758,-0.572198,45.425066
