id_mutation,date_mutation,numero_disposition,nature_mutation,valeur_fonciere,adresse_numero,adresse_suffixe,adresse_nom_voie,adresse_code_voie,code_postal,code_commune,nom_commune,code_departement,ancien_code_commune,ancien_nom_commune,id_parcelle,ancien_id_parcelle,numero_volume,lot1_numero,lot1_surface_carrez,lot2_numero,lot2_surface_carrez,lot3_numero,lot3_surface_carrez,lot4_numero,lot4_surface_carrez,lot5_numero,lot5_surface_carrez,nombre_lots,code_type_local,type_local,surface_reelle_bati,nombre_pieces_principales,code_nature_culture,nature_culture,code_nature_culture_speciale,nature_culture_speciale,surface_terrain,longitude,latitude
2020-219170,2020-01-27,000001,Vente,105000,6379,,IMP LA DESIRADE,1512,17500,17197,Jonzac,17,,,17197000AN0044,,,408,,49,,,,,,,,2,2,Appartement,64,2,,,,,,-0.424294,45.440839
2020-219172,2020-01-03,000001,Vente,10350,,,LES GRANDS CHAMPS,B068,17500,17197,Jonzac,17,,,17197000ZH0022,,,,,,,,,,,,,0,,,,,VI,vignes,,,6900,-0.413915,45.452023
2020-219208,2020-01-13,000001,Vente,33816.58,,,LA RABOTTERIE,B122,17500,17197,Jonzac,17,,,17197000AD0165,,,,,,,,,,,,,0,,,,,AB,terrains a bâtir,,,513,-0.446253,45.453843
2020-219239,2020-01-17,000001,Vente,170000,20,,AV DU 19 MARS 1962,1480,17500,17197,Jonzac,17,,,17197000AW0052,,,,,,,,,,,,,0,,,,,J,jardins,POTAG,Jardin potager,494,-0.448735,45.437781
2020-219239,2020-01-17,000001,Vente,170000,18,,LES GROIES DE CHEZ FOUCHE,B071,17500,17197,Jonzac,17,,,17197000AW0053,,,,,,,,,,,,,0,1,Maison,63,3,S,sols,,,817,-0.448657,45.438052
2020-219239,2020-01-17,000001,Vente,170000,,,LES CHARMES,B029,17500,17197,Jonzac,17,,,17197000AW0054,,,,,,,,,,,,,0,,,,,J,jardins,POTAG,Jardin potager,839,-0.449022,45.437996
2020-219240,2020-01-30,000001,Vente,820000,,,CHEZ FOUCHE,B034,17500,17197,Jonzac,17,,,17197000AW0032,,,,,,,,,,,,,0,,,,,S,sols,,,298,-0.445796,45.438361
2020-219240,2020-01-30,000001,Vente,820000,,,CHEZ FOUCHE,B034,17500,17197,Jonzac,17,,,17197000AW0033,,,,,,,,,,,,,0,,,,,S,sols,,,43,-0.445696,45.438448
2020-219240,2020-01-30,000001,Vente,820000,4,,LES GROIES DE CHEZ FOUCHE,B071,17500,17197,Jonzac,17,,,17197000AW0034,,,,,,,,,,,,,0,2,Appartement,25,1,S,sols,,,779,-0.4455,45.438608
2020-219240,2020-01-30,000001,Vente,820000,4,,LES GROIES DE CHEZ FOUCHE,B071,17500,17197,Jonzac,17,,,17197000AW0034,,,,,,,,,,,,,0,2,Appartement,25,1,S,sols,,,779,-0.4455,45.438608
2020-219240,2020-01-30,000001,Vente,820000,4,,LES GROIES DE CHEZ FOUCHE,B071,17500,17197,Jonzac,17,,,17197000AW0034,,,,,,,,,,,,,0,4,Local industriel. commercial ou assimilé,75,0,S,sols,,,779,-0.4455,45.438608
2020-219240,2020-01-30,000001,Vente,820000,4,,LES GROIES DE CHEZ FOUCHE,B071,17500,17197,Jonzac,17,,,17197000AW0034,,,,,,,,,,,,,0,1,Maison,115,4,S,sols,,,779,-0.4455,45.438608
2020-219240,2020-01-30,000001,Vente,820000,6,T,AV DU 19 MARS 1962,1480,17500,17197,Jonzac,17,,,17197000AW0036,,,,,,,,,,,,,0,2,Appartement,25,1,S,sols,,,1039,-0.445524,45.438377
2020-219240,2020-01-30,000001,Vente,820000,6,T,AV DU 19 MARS 1962,1480,17500,17197,Jonzac,17,,,17197000AW0036,,,,,,,,,,,,,0,2,Appartement,25,1,S,sols,,,1039,-0.445524,45.438377
2020-219240,2020-01-30,000001,Vente,820000,6,T,AV DU 19 MARS 1962,1480,17500,17197,Jonzac,17,,,17197000AW0036,,,,,,,,,,,,,0,2,Appartement,25,1,S,sols,,,1039,-0.445524,45.438377
2020-219240,2020-01-30,000001,Vente,820000,6,T,AV DU 19 MARS 1962,1480,17500,17197,Jonzac,17,,,17197000AW0036,,,,,,,,,,,,,0,2,Appartement,35,2,S,sols,,,1039,-0.445524,45.438377
2020-219240,2020-01-30,000001,Vente,820000,6,T,AV DU 19 MARS 1962,1480,17500,17197,Jonzac,17,,,17197000AW0036,,,,,,,,,,,,,0,2,Appartement,25,1,S,sols,,,1039,-0.445524,45.438377
2020-219240,2020-01-30,000001,Vente,820000,6,T,AV DU 19 MARS 1962,1480,17500,17197,Jonzac,17,,,17197000AW0036,,,,,,,,,,,,,0,2,Appartement,25,1,S,sols,,,1039,-0.445524,45.438377
2020-219240,2020-01-30,000001,Vente,820000,6,T,AV DU 19 MARS 1962,1480,17500,17197,Jonzac,17,,,17197000AW0036,,,,,,,,,,,,,0,2,Appartement,25,1,S,sols,,,1039,-0.445524,45.438377
2020-219240,2020-01-30,000001,Vente,820000,6,T,AV DU 19 MARS 1962,1480,17500,17197,Jonzac,17,,,17197000AW0036,,,,,,,,,,,,,0,2,Appartement,25,1,S,sols,,,1039,-0.445524,45.438377
2020-219240,2020-01-30,000001,Vente,820000,6,T,AV DU 19 MARS 1962,1480,17500,17197,Jonzac,17,,,17197000AW0036,,,,,,,,,,,,,0,2,Appartement,25,1,S,sols,,,1039,-0.445524,45.438377
2020-219240,2020-01-30,000001,Vente,820000,6,T,AV DU 19 MARS 1962,1480,17500,17197,Jonzac,17,,,17197000AW0036,,,,,,,,,,,,,0,2,Appartement,25,1,S,sols,,,1039,-0.445524,45.438377
2020-219240,2020-01-30,000001,Vente,820000,,,CHEZ FOUCHE,B034,17500,17197,Jonzac,17,,,17197000AW0076,,,,,,,,,,,,,0,,,,,P,prés,,,903,-0.446037,45.43835
2020-219252,2020-01-24,000001,Vente,60000,14,,CHE DES GROIES DE CHEZ FOUCHE,0009,17500,17197,Jonzac,17,,,17197000AW0043,,,,,,,,,,,,,0,1,Maison,45,2,S,sols,,,1050,-0.447253,45.438216
2020-219260,2020-01-23,000001,Vente,71000,60,,RUE DES CARMES,0180,17500,17197,Jonzac,17,,,17197000AK0046,,,2,42.57,,,,,,,,,1,4,Local industriel. commercial ou assimilé,90,0,,,,,,-0.435565,45.443061
2020-219293,2020-02-13,000001,Vente,7280,,,LES GRANDES TREUILLES EST,B065,17500,17197,Jonzac,17,,,17197000ZK0001,,,,,,,,,,,,,0,,,,,T,terres,,,4080,-0.407122,45.450607
2020-219293,2020-02-13,000001,Vente,7280,,,LES GRANDES TREUILLES EST,B065,17500,17197,Jonzac,17,,,17197000ZK0002,,,,,,,,,,,,,0,,,,,T,terres,,,3200,-0.406931,45.45066
2020-219299,2020-01-30,000001,Vente,140000,,,LES PLANTES,B102,17500,17197,Jonzac,17,,,17197000ZP0042,,,,,,,,,,,,,0,,,,,T,terres,,,600,-0.425166,45.426958
2020-219299,2020-01-30,000001,Vente,140000,6223,,LES PLANTES,B102,17500,17197,Jonzac,17,,,17197000ZP0092,,,,,,,,,,,,,0,1,Maison,88,4,S,sols,,,275,-0.425435,45.427384
2020-219319,2020-02-03,000001,Vente,110000,3,,RUE WINSTON CHURCHILL,1460,17500,17197,Jonzac,17,,,17197000AO0035,,,,,,,,,,,,,0,1,Maison,84,5,S,sols,,,855,-0.432942,45.439529
2020-219329,2020-01-08,000001,Vente,71500,6388,,RUE PIERRETTE,0003,17500,17197,Jonzac,17,,,17197000ZO0083,,,119,,,,,,,,,,1,3,Dépendance,,0,,,,,,-0.417928,45.437085
2020-219329,2020-01-08,000001,Vente,71500,6388,,RUE PIERRETTE,0003,17500,17197,Jonzac,17,,,17197000ZO0083,,,15,,,,,,,,,,1,2,Appartement,44,2,,,,,,-0.417928,45.437085
2020-219353,2020-02-17,000001,Vente,129250,8,,RUE DES CERISIERS,1521,17500,17197,Jonzac,17,,,17197000AT0011,,,,,,,,,,,,,0,1,Maison,94,5,S,sols,,,647,,
2020-219353,2020-02-17,000001,Vente,129250,8,,RUE DES CERISIERS,1521,17500,17197,Jonzac,17,,,17197000AT0011,,,,,,,,,,,,,0,1,Maison,94,5,T,terres,,,1000,,
2020-219354,2020-02-14,000001,Vente,166000,8,,RUE DE LA MARRONNERIE,0801,17500,17197,Jonzac,17,,,17197000AT0045,,,,,,,,,,,,,0,1,Maison,80,5,S,sols,,,453,-0.4397,45.435114
2020-219359,2020-02-27,000001,Vente,68000,6388,,RUE PIERRETTE,0003,17500,17197,Jonzac,17,,,17197000ZO0083,,,125,,,,,,,,,,1,3,Dépendance,,0,,,,,,-0.417928,45.437085
2020-219359,2020-02-27,000001,Vente,68000,6388,,RUE PIERRETTE,0003,17500,17197,Jonzac,17,,,17197000ZO0083,,,23,,,,,,,,,,1,2,Appartement,44,2,,,,,,-0.417928,45.437085
2020-219372,2020-01-31,000001,Vente,216000,35,,AV MAC CREA FLETCHER,0792,17500,17197,Jonzac,17,,,17197000AT0005,,,,,,,,,,,,,0,3,Dépendance,,0,S,sols,,,1892,-0.443834,45.432219
2020-219372,2020-01-31,000001,Vente,216000,35,,AV MAC CREA FLETCHER,0792,17500,17197,Jonzac,17,,,17197000AT0005,,,,,,,,,,,,,0,3,Dépendance,,0,T,terres,,,3073,-0.443834,45.432219
2020-219372,2020-01-31,000001,Vente,216000,,,AV MAC CREA FLETCHER,0792,17500,17197,Jonzac,17,,,17197000AT0006,,,,,,,,,,,,,0,,,,,S,sols,,,105,-0.444279,45.432452
2020-219387,2020-02-20,000002,Vente,12000,2,,RUE WINSTON CHURCHILL,1460,17500,17197,Jonzac,17,,,17197000AS0227,,,,,,,,,,,,,0,,,,,J,jardins,POTAG,Jardin potager,563,-0.434469,45.439724
2020-219434,2020-02-26,000001,Vente,100700,38,,RUE SAINT GERVAIS,1220,17500,17197,Jonzac,17,,,17197000AI0386,,,,,,,,,,,,,0,1,Maison,105,3,S,sols,,,148,-0.436338,45.445384
2020-219436,2020-02-26,000001,Vente,139000,9,T,RUE ALSACE LORRAINE,0060,17500,17197,Jonzac,17,,,17197000AS0196,,,,,,,,,,,,,0,,,,,S,sols,,,37,-0.439583,45.439064
2020-219436,2020-02-26,000001,Vente,139000,33,,RUE ALSACE LORRAINE,0060,17500,17197,Jonzac,17,,,17197000AS0201,,,,,,,,,,,,,0,1,Maison,78,4,S,sols,,,224,-0.439569,45.439112
2020-219440,2020-02-26,000001,Vente,89000,6388,,RUE PIERRETTE,0003,17500,17197,Jonzac,17,,,17197000ZO0083,,,81,,,,,,,,,,1,3,Dépendance,,0,,,,,,-0.417928,45.437085
2020-219440,2020-02-26,000001,Vente,89000,6388,,RUE PIERRETTE,0003,17500,17197,Jonzac,17,,,17197000ZO0083,,,46,,,,,,,,,,1,2,Appartement,44,2,,,,,,-0.417928,45.437085
2020-219462,2020-03-05,000001,Vente,350500,,,CHEZ PIAUD,B045,17500,17197,Jonzac,17,,,17197000ZL0084,,,,,,,,,,,,,0,,,,,BT,taillis simples,,,183,-0.413896,45.450937
2020-219462,2020-03-05,000001,Vente,350500,,,CHEZ PIAUD,B045,17500,17197,Jonzac,17,,,17197000ZL0089,,,,,,,,,,,,,0,,,,,J,jardins,,,780,-0.413568,45.450883
2020-219462,2020-03-05,000001,Vente,350500,2,,CHEZ PIAUD,B045,17500,17197,Jonzac,17,,,17197000ZL0090,,,,,,,,,,,,,0,1,Maison,360,9,S,sols,,,903,-0.413179,45.450866
2020-219462,2020-03-05,000001,Vente,350500,6392,,CHEZ PIAUD,B045,17500,17197,Jonzac,17,,,17197000ZL0111,,,,,,,,,,,,,0,3,Dépendance,,0,S,sols,,,922,-0.413269,45.451043
2020-219462,2020-03-05,000001,Vente,350500,6707,,CHEZ PIAUD,B045,17500,17197,Jonzac,17,,,17197000ZL0112,,,,,,,,,,,,,0,3,Dépendance,,0,S,sols,,,140,-0.41303,45.450982
2020-219488,2020-03-11,000001,Vente,160000,22,,AV MONSEIGNEUR CHAUVIN,0895,17500,17197,Jonzac,17,,,17197000AC0014,,,,,,,,,,,,,0,4,Local industriel. commercial ou assimilé,310,0,S,sols,,,1067,-0.438713,45.451489
2020-219488,2020-03-11,000001,Vente,160000,22,,AV MONSEIGNEUR CHAUVIN,0895,17500,17197,Jonzac,17,,,17197000AC0014,,,,,,,,,,,,,0,4,Local industriel. commercial ou assimilé,130,0,S,sols,,,1067,-0.438713,45.451489
2020-219500,2020-03-17,000001,Vente,122000,8,,RUE DU CHATEAU D EAU,0320,17500,17197,Jonzac,17,,,17197000AL0025,,,,,,,,,,,,,0,1,Maison,76,3,S,sols,,,119,-0.430231,45.445768
2020-219501,2020-03-20,000001,Vente,82000,36,,PL DU CHATEAU,0260,17500,17197,Jonzac,17,,,17197000AK0253,,,9,,,,,,,,,,1,3,Dépendance,,0,,,,,,-0.432859,45.445106
2020-219501,2020-03-20,000001,Vente,82000,36,,PL DU CHATEAU,0260,17500,17197,Jonzac,17,,,17197000AK0253,,,1,,,,,,,,,,1,2,Appartement,94,4,,,,,,-0.432859,45.445106
2020-219501,2020-03-20,000001,Vente,82000,36,,PL DU CHATEAU,0260,17500,17197,Jonzac,17,,,17197000AK0253,,,12,,,,,,,,,,1,3,Dépendance,,0,,,,,,-0.432859,45.445106
2020-219501,2020-03-20,000001,Vente,82000,36,,PL DU CHATEAU,0260,17500,17197,Jonzac,17,,,17197000AK0253,,,11,,,,,,,,,,1,3,Dépendance,,0,,,,,,-0.432859,45.445106
2020-219509,2020-03-27,000001,Vente,178500,5,,AV CHANZY,0240,17500,17197,Jonzac,17,,,17197000AS0127,,,,,,,,,,,,,0,1,Maison,143,4,S,sols,,,1012,-0.434062,45.439891
2020-219528,2020-04-10,000001,Vente,165000,53,,RUE DU PAS DE LA GARENNE,0960,17500,17197,Jonzac,17,,,17197000AX0010,,,,,,,,,,,,,0,,,,,P,prés,,,3476,-0.444843,45.443124
2020-219528,2020-04-10,000001,Vente,165000,53,,RUE DU PAS DE LA GARENNE,0960,17500,17197,Jonzac,17,,,17197000AX0010,,,,,,,,,,,,,0,,,,,S,sols,,,500,-0.444843,45.443124
2020-219528,2020-04-10,000001,Vente,165000,5530,A,PRES DE LA GARENNE,B115,17500,17197,Jonzac,17,,,17197000AX0011,,,,,,,,,,,,,0,1,Maison,81,1,S,sols,,,1067,-0.44439,45.443678
2020-219544,2020-04-22,000001,Vente,153500,1,,RUE JULIEN LAFERRIERE,0743,17500,17197,Jonzac,17,,,17197000AK0161,,,,,,,,,,,,,0,1,Maison,40,2,S,sols,,,149,-0.433715,45.441448
2020-219544,2020-04-22,000001,Vente,153500,1,,RUE JULIEN LAFERRIERE,0743,17500,17197,Jonzac,17,,,17197000AK0161,,,,,,,,,,,,,0,1,Maison,50,1,S,sols,,,149,-0.433715,45.441448
2020-219552,2020-04-30,000001,Vente,107500,5,,IMP DE LA GARENNE,1516,17500,17197,Jonzac,17,,,17197000AB0286,,,1,,,,,,,,,,1,2,Appartement,47,2,,,,,,-0.44448,45.445027
2020-219552,2020-04-30,000001,Vente,107500,5,,IMP DE LA GARENNE,1516,17500,17197,Jonzac,17,,,17197000AB0286,,,7,,,,,,,,,,1,3,Dépendance,,0,,,,,,-0.44448,45.445027
2020-219568,2020-02-27,000002,Echange,80000,5082,,LA MAILLOCHE,B081,17500,17197,Jonzac,17,,,17197000ZM0063,,,,,,,,,,,,,0,1,Maison,100,4,S,sols,,,6159,-0.40934,45.434952
2020-219568,2020-02-27,000002,Echange,80000,5082,,LA MAILLOCHE,B081,17500,17197,Jonzac,17,,,17197000ZM0063,,,,,,,,,,,,,0,1,Maison,100,4,BT,taillis simples,,,3763,-0.40934,45.434952
2020-219568,2020-02-27,000002,Echange,80000,5082,,LA MAILLOCHE,B081,17500,17197,Jonzac,17,,,17197000ZM0063,,,,,,,,,,,,,0,1,Maison,100,4,J,jardins,MARAI,Pré marais,620,-0.40934,45.434952
2020-219568,2020-02-27,000002,Echange,80000,5082,,LA MAILLOCHE,B081,17500,17197,Jonzac,17,,,17197000ZM0063,,,,,,,,,,,,,0,1,Maison,100,4,VE,vergers,,,1061,-0.40934,45.434952
2020-219568,2020-02-27,000002,Echange,80000,5082,,LA MAILLOCHE,B081,17500,17197,Jonzac,17,,,17197000ZM0063,,,,,,,,,,,,,0,1,Maison,100,4,L,landes,,,466,-0.40934,45.434952
2020-219568,2020-02-27,000002,Echange,80000,5082,,LA MAILLOCHE,B081,17500,17197,Jonzac,17,,,17197000ZM0063,,,,,,,,,,,,,0,1,Maison,100,4,T,terres,,,3931,-0.40934,45.434952
2020-219568,2020-02-27,000002,Echange,80000,,,LA MAILLOCHE,B081,17500,17197,Jonzac,17,,,17197000ZM0201,,,,,,,,,,,,,0,,,,,BT,taillis simples,,,6195,-0.406807,45.436683
2020-219571,2020-04-27,000001,Vente,150000,5285,,CHEZ MIGNONNEAU,B043,17500,17197,Jonzac,17,,,17197000AV0133,,,,,,,,,,,,,0,1,Maison,88,3,S,sols,,,833,-0.444222,45.435113
2020-219571,2020-04-27,000001,Vente,150000,,,FIEF DES BRANDES,B055,17500,17197,Jonzac,17,,,17197000AV0160,,,,,,,,,,,,,0,,,,,T,terres,,,1526,-0.444587,45.435056
2020-219571,2020-04-27,000001,Vente,150000,,,FIEF DES BRANDES,B055,17500,17197,Jonzac,17,,,17197000AV0161,,,,,,,,,,,,,0,,,,,T,terres,,,276,-0.444779,45.435241
2020-219584,2020-04-29,000001,Vente,300000,1,,BD BAIE ST PAUL,1481,17500,17197,Jonzac,17,,,17197000AC0159,,,,,,,,,,,,,0,4,Local industriel. commercial ou assimilé,300,0,S,sols,,,2102,-0.440332,45.451314
2020-219593,2020-04-30,000001,Vente,82237.5,20,,RUE TAILLEFER,1360,17500,17197,Jonzac,17,,,17197000AI0054,,,,,,,,,,,,,0,1,Maison,61,2,S,sols,,,216,-0.432367,45.44703
2020-219600,2020-02-28,000001,Vente,67000,6388,,RUE PIERRETTE,0003,17500,17197,Jonzac,17,,,17197000ZO0083,,,77,,,,,,,,,,1,3,Dépendance,,0,,,,,,-0.417928,45.437085
2020-219600,2020-02-28,000001,Vente,67000,6388,,RUE PIERRETTE,0003,17500,17197,Jonzac,17,,,17197000ZO0083,,,42,,,,,,,,,,1,2,Appartement,39,2,,,,,,-0.417928,45.437085
2020-219636,2020-05-02,000001,Vente,231690,10,,RUE SAINT GERVAIS,1220,17500,17197,Jonzac,17,,,17197000AI0340,,,,,,,,,,,,,0,1,Maison,180,4,S,sols,,,142,-0.435293,45.445481
2020-219637,2020-05-06,000001,Vente,153500,1,,CHANTEMERLE,B028,17500,17197,Jonzac,17,,,17197000ZI0120,,,,,,,,,,,,,0,1,Maison,120,5,S,sols,,,200,-0.415117,45.453919
2020-219637,2020-05-06,000001,Vente,153500,1,,CHANTEMERLE,B028,17500,17197,Jonzac,17,,,17197000ZI0120,,,,,,,,,,,,,0,1,Maison,120,5,J,jardins,POTAG,Jardin potager,349,-0.415117,45.453919
2020-219637,2020-05-06,000001,Vente,153500,1,,CHANTEMERLE,B028,17500,17197,Jonzac,17,,,17197000ZI0122,,,,,,,,,,,,,0,,,,,S,sols,,,300,-0.415251,45.453994
2020-219637,2020-05-06,000001,Vente,153500,1,,CHANTEMERLE,B028,17500,17197,Jonzac,17,,,17197000ZI0122,,,,,,,,,,,,,0,,,,,J,jardins,POTAG,Jardin potager,669,-0.415251,45.453994
2020-219655,2020-05-11,000001,Vente,121900,5,,RUE DES CERISIERS,1521,17500,17197,Jonzac,17,,,17197000AT0020,,,,,,,,,,,,,0,4,Local industriel. commercial ou assimilé,1580,0,S,sols,,,1881,-0.442394,45.432489
2020-219694,2020-05-25,000001,Vente,148000,12,,RUE DU DOCTEUR LAPORTE,0356,17500,17197,Jonzac,17,,,17197000AL0011,,,,,,,,,,,,,0,1,Maison,97,4,S,sols,,,64,-0.430817,45.445925
2020-219707,2020-06-05,000001,Vente,1,,,PRES DE BEAULIEU,B109,17500,17197,Jonzac,17,,,17197000ZC0017,,,,,,,,,,,,,0,,,,,T,terres,,,752,-0.417685,45.434715
2020-219707,2020-06-05,000001,Vente,1,,,PRES DE BEAULIEU,B109,17500,17197,Jonzac,17,,,17197000ZC0021,,,,,,,,,,,,,0,,,,,T,terres,,,201,-0.416792,45.434567
2020-219761,2020-05-28,000001,Vente,91000,10,,RUE DU BOURG NOUVEAU,0150,17500,17197,Jonzac,17,,,17197000AM0076,,,,,,,,,,,,,0,1,Maison,42,2,S,sols,,,91,-0.426452,45.446712
2020-219762,2020-06-03,000001,Vente,45000,64,,AV KENNEDY,0750,17500,17197,Jonzac,17,,,17197000AY0084,,,,,,,,,,,,,0,1,Maison,70,3,S,sols,,,458,-0.451163,45.443556
2020-219797,2020-05-27,000001,Vente,1,,,RUE ALSACE LORRAINE,0060,17500,17197,Jonzac,17,,,17197000AS0226,,,,,,,,,,,,,0,,,,,S,sols,,,1018,-0.43337,45.436714
2020-219836,2020-06-16,000001,Vente,35000,20,,RUE SADI CARNOT,1180,17500,17197,Jonzac,17,,,17197000AI0480,,,,,,,,,,,,,0,1,Maison,90,1,S,sols,,,43,-0.434669,45.444976
2020-219852,2020-06-22,000001,Vente,97000,6379,,IMP MARIE GALANTE,1511,17500,17197,Jonzac,17,,,17197000AN0044,,,24,,305,,,,,,,,2,2,Appartement,62,2,,,,,,-0.424294,45.440839
2020-219913,2020-06-30,000001,Vente,60000,24,,RUE FELIX FAURE,0460,17500,17197,Jonzac,17,,,17197000AI0038,,,,,,,,,,,,,0,3,Dépendance,,0,S,sols,,,354,-0.43469,45.447592
2020-219913,2020-06-30,000001,Vente,60000,24,,RUE FELIX FAURE,0460,17500,17197,Jonzac,17,,,17197000AI0038,,,,,,,,,,,,,0,2,Appartement,85,3,S,sols,,,354,-0.43469,45.447592
2020-219913,2020-06-30,000001,Vente,60000,24,,RUE FELIX FAURE,0460,17500,17197,Jonzac,17,,,17197000AI0038,,,,,,,,,,,,,0,2,Appartement,77,3,S,sols,,,354,-0.43469,45.447592
2020-219913,2020-06-30,000001,Vente,60000,24,,RUE FELIX FAURE,0460,17500,17197,Jonzac,17,,,17197000AI0038,,,,,,,,,,,,,0,3,Dépendance,,0,S,sols,,,354,-0.43469,45.447592
2020-219961,2020-07-09,000001,Vente,15720,,,LA RABOTTERIE,B122,17500,17197,Jonzac,17,,,17197000AD0021,,,,,,,,,,,,,0,,,,,T,terres,,,1572,-0.443001,45.455749
2020-219966,2020-07-10,000001,Vente,75250,3,,RUE DES CERISIERS,1521,17500,17197,Jonzac,17,,,17197000AT0021,,,,,,,,,,,,,0,1,Maison,110,6,S,sols,,,1492,-0.442524,45.432745
2020-219966,2020-07-10,000001,Vente,75250,3,,RUE DES CERISIERS,1521,17500,17197,Jonzac,17,,,17197000AT0021,,,,,,,,,,,,,0,1,Maison,110,6,T,terres,,,728,-0.442524,45.432745
2020-219982,2020-07-15,000001,Vente,161500,4,B,RUE HENRI BOSSUET,0716,17500,17197,Jonzac,17,,,17197000AI0035,,,,,,,,,,,,,0,1,Maison,99,5,J,jardins,POTAG,Jardin potager,674,-0.434166,45.448002
2020-219982,2020-07-15,000001,Vente,161500,4,B,RUE HENRI BOSSUET,0716,17500,17197,Jonzac,17,,,17197000AI0035,,,,,,,,,,,,,0,1,Maison,99,5,S,sols,,,301,-0.434166,45.448002
2020-220020,2020-07-20,000001,Vente,44842.93,13,,RUE VINCENT VAN GOGH,0005,17500,17197,Jonzac,17,,,17197000AD0118,,,,,,,,,,,,,0,,,,,AB,terrains a bâtir,,,812,-0.447369,45.453211
2020-220036,2020-08-06,000001,Vente,121800,15,,BD GAUTRET,0610,17500,17197,Jonzac,17,,,17197000AM0105,,,3,19.47,,,,,,,,,1,4,Local industriel. commercial ou assimilé,20,0,,,,,,-0.428253,45.447453
2020-220041,2020-07-29,000001,Vente,250000,1,,RUE DU BOURG NOUVEAU,0150,17500,17197,Jonzac,17,,,17197000AM0017,,,,,,,,,,,,,0,1,Maison,45,1,AG,terrains d'agrément,PARC,Parc,3470,-0.427441,45.446884
2020-220041,2020-07-29,000001,Vente,250000,1,,RUE DU BOURG NOUVEAU,0150,17500,17197,Jonzac,17,,,17197000AM0017,,,,,,,,,,,,,0,1,Maison,45,1,S,sols,,,1701,-0.427441,45.446884
2020-220041,2020-07-29,000001,Vente,250000,1,,RUE DU BOURG NOUVEAU,0150,17500,17197,Jonzac,17,,,17197000AM0017,,,,,,,,,,,,,0,3,Dépendance,,0,S,sols,,,1701,-0.427441,45.446884
2020-220041,2020-07-29,000001,Vente,250000,1,,RUE DU BOURG NOUVEAU,0150,17500,17197,Jonzac,17,,,17197000AM0017,,,,,,,,,,,,,0,1,Maison,245,9,S,sols,,,1701,-0.427441,45.446884
2020-220041,2020-07-29,000001,Vente,250000,1,,RUE DU BOURG NOUVEAU,0150,17500,17197,Jonzac,17,,,17197000AM0017,,,,,,,,,,,,,0,1,Maison,45,1,J,jardins,POTAG,Jardin potager,601,-0.427441,45.446884
2020-220041,2020-07-29,000001,Vente,250000,1,,RUE DU BOURG NOUVEAU,0150,17500,17197,Jonzac,17,,,17197000AM0017,,,,,,,,,,,,,0,3,Dépendance,,0,J,jardins,POTAG,Jardin potager,601,-0.427441,45.446884
2020-220041,2020-07-29,000001,Vente,250000,1,,RUE DU BOURG NOUVEAU,0150,17500,17197,Jonzac,17,,,17197000AM0017,,,,,,,,,,,,,0,1,Maison,245,9,AG,terrains d'agrément,PARC,Parc,3470,-0.427441,45.446884
2020-220041,2020-07-29,000001,Vente,250000,1,,RUE DU BOURG NOUVEAU,0150,17500,17197,Jonzac,17,,,17197000AM0017,,,,,,,,,,,,,0,3,Dépendance,,0,AG,terrains d'agrément,PARC,Parc,3470,-0.427441,45.446884
2020-220041,2020-07-29,000001,Vente,250000,1,,RUE DU BOURG NOUVEAU,0150,17500,17197,Jonzac,17,,,17197000AM0017,,,,,,,,,,,,,0,1,Maison,245,9,J,jardins,POTAG,Jardin potager,601,-0.427441,45.446884
2020-220048,2020-07-28,000001,Vente,155000,38,,CHE DE MAISON ROUGE,1483,17500,17197,Jonzac,17,,,17197000AD0051,,,,,,,,,,,,,0,1,Maison,68,3,S,sols,,,1138,-0.446592,45.451775
2020-220059,2020-07-30,000001,Vente,75000,4,,RUE DU BOURG NOUVEAU,0150,17500,17197,Jonzac,17,,,17197000AM0088,,,,,,,,,,,,,0,1,Maison,160,6,S,sols,,,214,-0.426928,45.446575
2020-220066,2020-08-03,000001,Vente,185000,7,,IMP MIGNONNEAU,1503,17500,17197,Jonzac,17,,,17197000AV0196,,,,,,,,,,,,,0,1,Maison,120,4,S,sols,,,500,-0.44306,45.435868
2020-220066,2020-08-03,000001,Vente,185000,7,,IMP MIGNONNEAU,1503,17500,17197,Jonzac,17,,,17197000AV0196,,,,,,,,,,,,,0,1,Maison,120,4,AG,terrains d'agrément,PARC,Parc,550,-0.44306,45.435868
2020-220074,2020-08-04,000001,Vente,29900,,,BOIS DU FIEF DES CHAILLES,B016,17500,17197,Jonzac,17,,,17197000AM0044,,,,,,,,,,,,,0,,,,,T,terres,,,1768,-0.421321,45.444113
2020-220079,2020-08-04,000002,Vente,1820,,,CHEZ GARNIER,B037,17500,17197,Jonzac,17,,,17197000ZI0134,,,,,,,,,,,,,0,,,,,T,terres,,,72,-0.406766,45.452612
2020-220079,2020-08-04,000002,Vente,1820,,,CHEZ GARNIER,B037,17500,17197,Jonzac,17,,,17197000ZI0165,,,,,,,,,,,,,0,,,,,T,terres,,,292,-0.406966,45.452427
2020-220084,2020-08-20,000001,Vente,5000,,,FIEF DU CHAILLE,B057,17500,17197,Jonzac,17,,,17197000ZL0046,,,,,,,,,,,,,0,,,,,T,terres,,,4530,-0.419052,45.443758
2020-220084,2020-08-20,000001,Vente,5000,,,BOIS DES RENTES,B014,17500,17197,Jonzac,17,,,17197000ZM0164,,,,,,,,,,,,,0,,,,,BT,taillis simples,,,5711,-0.401942,45.437467
2020-220085,2020-08-19,000001,Vente,130000,17,,CITE MIGNONNEAU,A035,17500,17197,Jonzac,17,,,17197000AV0039,,,,,,,,,,,,,0,1,Maison,71,3,S,sols,,,15,-0.444533,45.438452
2020-220085,2020-08-19,000001,Vente,130000,17,,CITE MIGNONNEAU,A035,17500,17197,Jonzac,17,,,17197000AV0057,,,,,,,,,,,,,0,,,,,S,sols,,,696,-0.444395,45.438342
2020-220086,2020-08-03,000001,Vente,205900,5,,PL FILLAUDEAU,0480,17500,17197,Jonzac,17,,,17197000AI0155,,,,,,,,,,,,,0,4,Local industriel. commercial ou assimilé,25,0,S,sols,,,510,-0.431459,45.446736
2020-220086,2020-08-03,000001,Vente,205900,5,,PL FILLAUDEAU,0480,17500,17197,Jonzac,17,,,17197000AI0155,,,,,,,,,,,,,0,1,Maison,47,1,S,sols,,,510,-0.431459,45.446736
2020-220086,2020-08-03,000001,Vente,205900,5,,PL FILLAUDEAU,0480,17500,17197,Jonzac,17,,,17197000AI0155,,,,,,,,,,,,,0,3,Dépendance,,0,S,sols,,,510,-0.431459,45.446736
2020-220086,2020-08-03,000001,Vente,205900,5,,PL FILLAUDEAU,0480,17500,17197,Jonzac,17,,,17197000AI0155,,,,,,,,,,,,,0,2,Appartement,35,1,S,sols,,,510,-0.431459,45.446736
2020-220086,2020-08-03,000001,Vente,205900,5,,PL FILLAUDEAU,0480,17500,17197,Jonzac,17,,,17197000AI0155,,,,,,,,,,,,,0,2,Appartement,43,1,S,sols,,,510,-0.431459,45.446736
2020-220086,2020-08-03,000001,Vente,205900,5,,PL FILLAUDEAU,0480,17500,17197,Jonzac,17,,,17197000AI0155,,,,,,,,,,,,,0,3,Dépendance,,0,S,sols,,,510,-0.431459,45.446736
2020-220086,2020-08-03,000001,Vente,205900,5,,PL FILLAUDEAU,0480,17500,17197,Jonzac,17,,,17197000AI0155,,,,,,,,,,,,,0,2,Appartement,30,1,S,sols,,,510,-0.431459,45.446736
2020-220086,2020-08-03,000001,Vente,205900,5,,PL FILLAUDEAU,0480,17500,17197,Jonzac,17,,,17197000AI0155,,,,,,,,,,,,,0,3,Dépendance,,0,S,sols,,,510,-0.431459,45.446736
2020-220086,2020-08-03,000001,Vente,205900,5,,PL FILLAUDEAU,0480,17500,17197,Jonzac,17,,,17197000AI0155,,,,,,,,,,,,,0,2,Appartement,35,1,S,sols,,,510,-0.431459,45.446736
2020-220087,2020-08-03,000001,Vente,221900,5,,PL FILLAUDEAU,0480,17500,17197,Jonzac,17,,,17197000AI0155,,,,,,,,,,,,,0,2,Appartement,30,1,S,sols,,,510,-0.431459,45.446736