id_mutation,date_mutation,numero_disposition,nature_mutation,valeur_fonciere,adresse_numero,adresse_suffixe,adresse_nom_voie,adresse_code_voie,code_postal,code_commune,nom_commune,code_departement,ancien_code_commune,ancien_nom_commune,id_parcelle,ancien_id_parcelle,numero_volume,lot1_numero,lot1_surface_carrez,lot2_numero,lot2_surface_carrez,lot3_numero,lot3_surface_carrez,lot4_numero,lot4_surface_carrez,lot5_numero,lot5_surface_carrez,nombre_lots,code_type_local,type_local,surface_reelle_bati,nombre_pieces_principales,code_nature_culture,nature_culture,code_nature_culture_speciale,nature_culture_speciale,surface_terrain,longitude,latitude
2020-219149,2020-01-16,000001,Vente,190000,,,PICOULADE,B052,17500,17345,Saint-Hilaire-du-Bois,17,,,173450000A0871,,,,,,,,,,,,,0,,,,,S,sols,,,90,-0.498946,45.428658
2020-219149,2020-01-16,000001,Vente,190000,,,PICOULADE,B052,17500,17345,Saint-Hilaire-du-Bois,17,,,173450000A0872,,,,,,,,,,,,,0,,,,,S,sols,,,32,-0.498964,45.428741
2020-219149,2020-01-16,000001,Vente,190000,,,PICOULADE,B052,17500,17345,Saint-Hilaire-du-Bois,17,,,173450000A0873,,,,,,,,,,,,,0,,,,,S,sols,,,160,-0.498871,45.428708
2020-219149,2020-01-16,000001,Vente,190000,,,PICOULADE,B052,17500,17345,Saint-Hilaire-du-Bois,17,,,173450000A0875,,,,,,,,,,,,,0,,,,,S,sols,,,599,-0.498711,45.428779
2020-219178,2020-01-06,000001,Vente,4500,,,CHEZ GIRAUDEAU,B028,17500,17345,Saint-Hilaire-du-Bois,17,,,173450000A0997,,,,,,,,,,,,,0,,,,,T,terres,,,13720,-0.50365,45.423439
2020-219560,2020-04-27,000001,Vente,30000,,,LE CLONE,B035,17500,17345,Saint-Hilaire-du-Bois,17,,,173450000A1557,,,,,,,,,,,,,0,,,,,AB,terrains a bâtir,,,970,-0.484866,45.448938
2020-219732,2020-05-27,000001,Vente,185000,9,,CHE DE CHEZ VIEUILLE,0011,17500,17345,Saint-Hilaire-du-Bois,17,,,173450000B1056,,,,,,,,,,,,,0,1,Maison,80,5,S,sols,,,600,-0.504694,45.415386
2020-219732,2020-05-27,000001,Vente,185000,9,,CHE DE CHEZ VIEUILLE,0011,17500,17345,Saint-Hilaire-du-Bois,17,,,173450000B1056,,,,,,,,,,,,,0,1,Maison,80,5,S,sols,,,600,-0.504694,45.415386
2020-219732,2020-05-27,000001,Vente,185000,,,CHEZ VIEUILLE,B034,17500,17345,Saint-Hilaire-du-Bois,17,,,173450000B1060,,,,,,,,,,,,,0,,,,,S,sols,,,120,-0.50473,45.415613
2020-219732,2020-05-27,000001,Vente,185000,,,CHEZ VIEUILLE,B034,17500,17345,Saint-Hilaire-du-Bois,17,,,173450000B1061,,,,,,,,,,,,,0,,,,,AB,terrains a bâtir,,,877,-0.504501,45.415797
2020-219732,2020-05-27,000001,Vente,185000,,,CHEZ VIEUILLE,B034,17500,17345,Saint-Hilaire-du-Bois,17,,,173450000B1758,,,,,,,,,,,,,0,,,,,S,sols,,,185,-0.504903,45.415458
2020-219732,2020-05-27,000001,Vente,185000,,,CHEZ VIEUILLE,B034,17500,17345,Saint-Hilaire-du-Bois,17,,,173450000B1759,,,,,,,,,,,,,0,,,,,P,prés,,,1715,-0.504296,45.415645
2020-219922,2020-07-02,000001,Vente,210515,5,,RUE DES CHAMPS,0021,17500,17345,Saint-Hilaire-du-Bois,17,,,173450000A0868,,,,,,,,,,,,,0,1,Maison,148,6,S,sols,,,855,-0.499557,45.428319
2020-219922,2020-07-02,000001,Vente,210515,,,LES CHAMPS DE PICOULADE,B022,17500,17345,Saint-Hilaire-du-Bois,17,,,173450000A1231,,,,,,,,,,,,,0,,,,,T,terres,,,1505,-0.500407,45.427934
2020-219922,2020-07-02,000001,Vente,210515,,,LES CHAMPS DE PICOULADE,B022,17500,17345,Saint-Hilaire-du-Bois,17,,,173450000A1481,,,,,,,,,,,,,0,,,,,S,sols,,,359,-0.499396,45.428157
2020-219922,2020-07-02,000001,Vente,210515,,,LES CHAMPS DE PICOULADE,B022,17500,17345,Saint-Hilaire-du-Bois,17,,,173450000A1485,,,,,,,,,,,,,0,,,,,S,sols,,,140,-0.500071,45.428173
2020-219922,2020-07-02,000001,Vente,210515,,,PICOULADE,B052,17500,17345,Saint-Hilaire-du-Bois,17,,,173450000A1508,,,,,,,,,,,,,0,,,,,S,sols,,,346,-0.499431,45.428257
2020-219922,2020-07-02,000001,Vente,210515,,,PICOULADE,B052,17500,17345,Saint-Hilaire-du-Bois,17,,,173450000A1509,,,,,,,,,,,,,0,,,,,S,sols,,,16,-0.499521,45.428215
2020-220018,2020-07-25,000001,Vente,152000,21,,RTE DU FORESTIER,0005,17500,17345,Saint-Hilaire-du-Bois,17,,,173450000B1792,,,,,,,,,,,,,0,1,Maison,96,4,S,sols,,,1800,-0.48596,45.422048
2020-220019,2020-07-03,000001,Vente,31000,5,,RTE DES GROSSES PIERRES,0003,17500,17345,Saint-Hilaire-du-Bois,17,,,173450000A1622,,,,,,,,,,,,,0,3,Dépendance,,0,S,sols,,,330,-0.49527,45.41784
2020-220328,2020-09-21,000001,Vente,120000,20,,RUE DE PICOULADE,0020,17500,17345,Saint-Hilaire-du-Bois,17,,,173450000A1543,,,,,,,,,,,,,0,1,Maison,83,4,J,jardins,,,565,-0.501495,45.423848
2020-220328,2020-09-21,000001,Vente,120000,20,,RUE DE PICOULADE,0020,17500,17345,Saint-Hilaire-du-Bois,17,,,173450000A1543,,,,,,,,,,,,,0,1,Maison,83,4,S,sols,,,500,-0.501495,45.423848
2020-220761,2020-12-10,000001,Vente,150000,,,LE FORESTIER,B039,17500,17345,Saint-Hilaire-du-Bois,17,,,173450000B1486,,,,,,,,,,,,,0,,,,,P,prés,,,240,-0.485862,45.423089
2020-220761,2020-12-10,000001,Vente,150000,18,,RTE DU FORESTIER,0005,17500,17345,Saint-Hilaire-du-Bois,17,,,173450000B1487,,,,,,,,,,,,,0,1,Maison,150,5,S,sols,,,526,-0.485734,45.422937
2020-220761,2020-12-10,000001,Vente,150000,,,LE FORESTIER,B039,17500,17345,Saint-Hilaire-du-Bois,17,,,173450000B1869,,,,,,,,,,,,,0,,,,,T,terres,,,180,-0.48596,45.423104
2020-220761,2020-12-10,000001,Vente,150000,,,LE FORESTIER,B039,17500,17345,Saint-Hilaire-du-Bois,17,,,173450000B2161,,,,,,,,,,,,,0,,,,,S,sols,,,28,-0.485818,45.423059
2020-220946,2020-12-29,000001,Vente,155509,,,LES GENETS,B042,17500,17345,Saint-Hilaire-du-Bois,17,,,173450000A0699,,,,,,,,,,,,,0,,,,,T,terres,,,1700,-0.493054,45.433187
2020-220946,2020-12-29,000001,Vente,155509,,,LES GENETS,B042,17500,17345,Saint-Hilaire-du-Bois,17,,,173450000A1649,,,,,,,,,,,,,0,,,,,T,terres,,,5890,-0.493813,45.433609
2020-220946,2020-12-29,000001,Vente,155509,,,LES GENETS,B042,17500,17345,Saint-Hilaire-du-Bois,17,,,173450000A1650,,,,,,,,,,,,,0,,,,,T,terres,,,4025,-0.494206,45.432595
2020-220946,2020-12-29,000001,Vente,155509,,,LES GENETS,B042,17500,17345,Saint-Hilaire-du-Bois,17,,,173450000A1651,,,,,,,,,,,,,0,,,,,T,terres,,,16215,-0.494568,45.433067
2020-220946,2020-12-29,000001,Vente,155509,,,LA COMBE DE BOURDENNE,B036,17500,17345,Saint-Hilaire-du-Bois,17,,,173450000A1652,,,,,,,,,,,,,0,,,,,T,terres,,,7240,-0.493174,45.434023
2020-220946,2020-12-29,000001,Vente,155509,,,LES GENETS,B042,17500,17345,Saint-Hilaire-du-Bois,17,,,173450000A1653,,,,,,,,,,,,,0,,,,,T,terres,,,1400,-0.495128,45.433563
2020-220946,2020-12-29,000001,Vente,155509,,,LES GENETS,B042,17500,17345,Saint-Hilaire-du-Bois,17,,,173450000A1653,,,,,,,,,,,,,0,,,,,T,terres,,,3410,-0.495128,45.433563
2020-220946,2020-12-29,000001,Vente,155509,,,LES GENETS,B042,17500,17345,Saint-Hilaire-du-Bois,17,,,173450000A1654,,,,,,,,,,,,,0,,,,,T,terres,,,13870,-0.494934,45.432083
2020-220946,2020-12-29,000001,Vente,155509,,,LES GENETS,B042,17500,17345,Saint-Hilaire-du-Bois,17,,,173450000A1654,,,,,,,,,,,,,0,,,,,T,terres,,,1700,-0.494934,45.432083
