id_mutation,date_mutation,numero_disposition,nature_mutation,valeur_fonciere,adresse_numero,adresse_suffixe,adresse_nom_voie,adresse_code_voie,code_postal,code_commune,nom_commune,code_departement,ancien_code_commune,ancien_nom_commune,id_parcelle,ancien_id_parcelle,numero_volume,lot1_numero,lot1_surface_carrez,lot2_numero,lot2_surface_carrez,lot3_numero,lot3_surface_carrez,lot4_numero,lot4_surface_carrez,lot5_numero,lot5_surface_carrez,nombre_lots,code_type_local,type_local,surface_reelle_bati,nombre_pieces_principales,code_nature_culture,nature_culture,code_nature_culture_speciale,nature_culture_speciale,surface_terrain,longitude,latitude
2020-215291,2020-02-24,000001,Vente,18816,,,LES MONTOURTEAUX,B058,17770,17426,Le Seure,17,,,17426000ZB0049,,,,,,,,,,,,,0,,,,,VI,vignes,,,4480,-0.341114,45.794809
2020-215638,2020-02-27,000001,Vente,52000,6,,RTE DU MOULIN NOIR,0240,17770,17426,Le Seure,17,,,174260000A0286,,,,,,,,,,,,,0,1,Maison,32,1,S,sols,,,435,-0.36516,45.79891
2020-215638,2020-02-27,000001,Vente,52000,,,OUCHE LUGUE,B061,17770,17426,Le Seure,17,,,174260000A0292,,,,,,,,,,,,,0,,,,,T,terres,,,1235,-0.365856,45.79836
2020-215698,2020-04-21,000001,Vente,25000,,,LE MAINE,B053,17770,17426,Le Seure,17,,,174260000B0888,,,,,,,,,,,,,0,4,Local industriel. commercial ou assimilé,700,0,S,sols,,,580,-0.364137,45.786005
2020-215698,2020-04-21,000001,Vente,25000,,,LE MAINE,B053,17770,17426,Le Seure,17,,,174260000B0888,,,,,,,,,,,,,0,4,Local industriel. commercial ou assimilé,700,0,T,terres,,,895,-0.364137,45.786005
2020-215717,2020-01-17,000001,Vente,28460,,,JARDINS DES FENETRES,B050,17770,17426,Le Seure,17,,,174260000A0334,,,,,,,,,,,,,0,,,,,BS,taillis sous futaie,,,730,-0.372116,45.797975
2020-215717,2020-01-17,000001,Vente,28460,,,MOULIN DE VERGNEE,B059,17770,17426,Le Seure,17,,,174260000B0160,,,,,,,,,,,,,0,,,,,BS,taillis sous futaie,,,925,-0.37063,45.78701
2020-215717,2020-01-17,000001,Vente,28460,,,MOULIN DE VERGNEE,B059,17770,17426,Le Seure,17,,,174260000B0161,,,,,,,,,,,,,0,,,,,BS,taillis sous futaie,,,120,-0.370739,45.78741
2020-215717,2020-01-17,000001,Vente,28460,,,BASSES VERGNES,B007,17770,17426,Le Seure,17,,,174260000B0499,,,,,,,,,,,,,0,,,,,BS,taillis sous futaie,,,276,-0.360997,45.781832
2020-215717,2020-01-17,000001,Vente,28460,,,BOIS DE LA BOUTIQUE,B008,17770,17426,Le Seure,17,,,174260000B0663,,,,,,,,,,,,,0,,,,,BS,taillis sous futaie,,,210,-0.368706,45.785452
2020-215717,2020-01-17,000001,Vente,28460,,,BOIS DE LA BOUTIQUE,B008,17770,17426,Le Seure,17,,,174260000B0684,,,,,,,,,,,,,0,,,,,BS,taillis sous futaie,,,190,-0.368388,45.784526
2020-215717,2020-01-17,000001,Vente,28460,,,BOIS DE LA BOUTIQUE,B008,17770,17426,Le Seure,17,,,174260000B0685,,,,,,,,,,,,,0,,,,,BS,taillis sous futaie,,,240,-0.368494,45.784484
2020-215717,2020-01-17,000001,Vente,28460,,,LA GUERENNE,B045,17770,17426,Le Seure,17,,,174260000B0731,,,,,,,,,,,,,0,,,,,BS,taillis sous futaie,,,210,-0.366642,45.784141
2020-215717,2020-01-17,000001,Vente,28460,,,JARDINS DES ROUX,B051,17770,17426,Le Seure,17,,,174260000B0745,,,,,,,,,,,,,0,,,,,J,jardins,,,235,-0.366368,45.784717
2020-215717,2020-01-17,000001,Vente,28460,,,FIEF DES BOUCHAUDS,B036,17770,17426,Le Seure,17,,,17426000ZC0097,,,,,,,,,,,,,0,,,,,T,terres,,,2460,-0.344252,45.788294
2020-216641,2020-07-20,000001,Vente,250,,,PRES DES ROUX,B075,17770,17426,Le Seure,17,,,174260000B0976,,,,,,,,,,,,,0,,,,,B,bois,,,1225,-0.364541,45.781579
2020-217339,2020-09-21,000001,Vente,70000,10,,IMP DES OISEAUX,0260,17770,17426,Le Seure,17,,,174260000B0830,,,,,,,,,,,,,0,1,Maison,75,2,S,sols,,,460,-0.362732,45.785461
2020-217339,2020-09-21,000001,Vente,70000,,,LE MAINE,B053,17770,17426,Le Seure,17,,,174260000B0831,,,,,,,,,,,,,0,,,,,J,jardins,,,360,-0.362577,45.785281
2020-217442,2020-09-21,000001,Vente,79000,1,,RUE DES PLATANES,0280,17770,17426,Le Seure,17,,,174260000B0872,,,,,,,,,,,,,0,1,Maison,70,3,S,sols,,,112,-0.364202,45.785374
2020-217442,2020-09-21,000001,Vente,79000,5162,,LE MAINE,B053,17770,17426,Le Seure,17,,,174260000B0996,,,,,,,,,,,,,0,3,Dépendance,,0,S,sols,,,40,-0.364266,45.785498
2020-217532,2020-10-05,000001,Vente,977,,,BASSES VERGNES,B007,17770,17426,Le Seure,17,,,174260000B0575,,,,,,,,,,,,,0,,,,,BS,taillis sous futaie,,,1000,-0.363239,45.782622
2020-217532,2020-10-05,000001,Vente,977,,,BASSES VERGNES,B007,17770,17426,Le Seure,17,,,174260000B0577,,,,,,,,,,,,,0,,,,,BS,taillis sous futaie,,,900,-0.362573,45.782584
2020-217532,2020-10-05,000001,Vente,977,,,LES ESSERTS,B032,17770,17426,Le Seure,17,,,174260000B0649,,,,,,,,,,,,,0,,,,,P,prés,,,910,-0.369444,45.783869
2020-217532,2020-10-05,000001,Vente,977,,,BOIS DE LA BOUTIQUE,B008,17770,17426,Le Seure,17,,,174260000B0705,,,,,,,,,,,,,0,,,,,BS,taillis sous futaie,,,670,-0.367445,45.784896
2020-217532,2020-10-05,000001,Vente,977,,,LA GUERENNE,B045,17770,17426,Le Seure,17,,,174260000B0719,,,,,,,,,,,,,0,,,,,BS,taillis sous futaie,,,1790,-0.367298,45.783885
2020-217532,2020-10-05,000001,Vente,977,,,LA GUERENNE,B045,17770,17426,Le Seure,17,,,174260000B0724,,,,,,,,,,,,,0,,,,,P,prés,,,1245,-0.367072,45.783727
2020-217564,2020-10-06,000001,Vente terrain à bâtir,24447,,,COMMUNAL DU FOURNEAU,B029,17770,17426,Le Seure,17,,,174260000C1024,,,,,,,,,,,,,0,,,,,AB,terrains a bâtir,,,843,-0.351339,45.797095
2020-217733,2020-10-15,000001,Vente,63000,4,,RUE DES FINS BOIS,0110,17770,17426,Le Seure,17,,,174260000B0293,,,,,,,,,,,,,0,1,Maison,185,9,S,sols,,,321,-0.36716,45.789991
2020-217733,2020-10-15,000001,Vente,63000,,,LE BOURG,B014,17770,17426,Le Seure,17,,,174260000B0318,,,,,,,,,,,,,0,,,,,J,jardins,,,395,-0.36707,45.78978
2020-218140,2020-10-26,000001,Vente,1500,,,LA MENERIE,B055,17770,17426,Le Seure,17,,,17426000ZA0013,,,,,,,,,,,,,0,,,,,T,terres,,,3230,-0.365084,45.799768
2020-218519,2020-12-04,000001,Vente,68794.6,,,PRE DE LA BARRE,B069,17770,17426,Le Seure,17,,,174260000A0633,,,,,,,,,,,,,0,,,,,VI,vignes,,,15818,-0.354166,45.801157
2020-218520,2020-12-04,000002,Vente,85883.1,,,PRE DE LA BARRE,B069,17770,17426,Le Seure,17,,,174260000A0606,,,,,,,,,,,,,0,,,,,VI,vignes,,,2454,-0.355356,45.801628
2020-218520,2020-12-04,000002,Vente,85883.1,,,PRE DE LA BARRE,B069,17770,17426,Le Seure,17,,,174260000A0632,,,,,,,,,,,,,0,,,,,VI,vignes,,,15819,-0.354159,45.801914
2020-219061,2020-12-30,000001,Vente,170000,6,,RTE DES ROCHEFORTS,0340,17770,17426,Le Seure,17,,,174260000C0728,,,,,,,,,,,,,0,1,Maison,177,4,S,sols,,,750,-0.352351,45.797674
2020-219061,2020-12-30,000001,Vente,170000,6,,RTE DES ROCHEFORTS,0340,17770,17426,Le Seure,17,,,174260000C0728,,,,,,,,,,,,,0,3,Dépendance,,0,S,sols,,,750,-0.352351,45.797674
2020-219061,2020-12-30,000001,Vente,170000,,,COMMUNAL DU FOURNEAU,B029,17770,17426,Le Seure,17,,,174260000C0959,,,,,,,,,,,,,0,,,,,L,landes,FRICH,Friche,57,-0.351973,45.797685
2020-219061,2020-12-30,000001,Vente,170000,,,COMMUNAL DU FOURNEAU,B029,17770,17426,Le Seure,17,,,174260000C0961,,,,,,,,,,,,,0,,,,,L,landes,FRICH,Friche,348,-0.351847,45.797642
