id_mutation,date_mutation,numero_disposition,nature_mutation,valeur_fonciere,adresse_numero,adresse_suffixe,adresse_nom_voie,adresse_code_voie,code_postal,code_commune,nom_commune,code_departement,ancien_code_commune,ancien_nom_commune,id_parcelle,ancien_id_parcelle,numero_volume,lot1_numero,lot1_surface_carrez,lot2_numero,lot2_surface_carrez,lot3_numero,lot3_surface_carrez,lot4_numero,lot4_surface_carrez,lot5_numero,lot5_surface_carrez,nombre_lots,code_type_local,type_local,surface_reelle_bati,nombre_pieces_principales,code_nature_culture,nature_culture,code_nature_culture_speciale,nature_culture_speciale,surface_terrain,longitude,latitude
2020-221006,2020-01-06,000001,Vente,10000,,,LE BOURG,B006,17470,17473,Villemorin,17,,,174730000A0350,,,,,,,,,,,,,0,,,,,S,sols,,,140,-0.296504,46.002889
2020-221325,2020-03-11,000001,Vente,11835,,,LES CROCHETS,B013,17470,17473,Villemorin,17,,,17473000ZA0125,,,,,,,,,,,,,0,,,,,T,terres,,,553,-0.29806,46.004631
2020-221325,2020-03-11,000001,Vente,11835,,,LES CROCHETS,B013,17470,17473,Villemorin,17,,,17473000ZA0129,,,,,,,,,,,,,0,,,,,T,terres,,,2274,-0.297725,46.004422
2020-221350,2020-04-03,000001,Vente,197950,,,LE BOURG,B006,17470,17473,Villemorin,17,,,174730000A0298,,,,,,,,,,,,,0,,,,,J,jardins,,,480,-0.294312,46.002309
2020-221350,2020-04-03,000001,Vente,197950,,,LE BOURG,B006,17470,17473,Villemorin,17,,,174730000A0299,,,,,,,,,,,,,0,,,,,S,sols,,,5,-0.294219,46.002303
2020-221350,2020-04-03,000001,Vente,197950,1,,IMP DU MIDI,0071,17470,17473,Villemorin,17,,,174730000A0975,,,,,,,,,,,,,0,1,Maison,122,4,S,sols,,,832,-0.294478,46.002196
2020-221356,2020-03-11,000001,Vente,43425,,,LA ROCHE SUD,B048,17470,17473,Villemorin,17,,,17473000ZD0046,,,,,,,,,,,,,0,,,,,T,terres,,,8509,-0.333566,45.988001
2020-222088,2020-09-16,000001,Vente,5000,,,SOUS LE BOIS,B052,17470,17473,Villemorin,17,,,17473000ZD0029,,,,,,,,,,,,,0,,,,,T,terres,,,8577,-0.32941,45.988786
2020-222088,2020-09-16,000001,Vente,5000,,,FIEF DU CLUZEAU,B018,17470,17473,Villemorin,17,,,17473000ZE0001,,,,,,,,,,,,,0,,,,,T,terres,,,2070,-0.318779,45.985854
2020-222696,2020-12-15,000001,Vente,80000,,,LES PERAUDS SUD,B035,17470,17473,Villemorin,17,,,17473000ZA0118,,,,,,,,,,,,,0,,,,,T,terres,,,2777,-0.289942,46.001249
2020-222696,2020-12-15,000001,Vente,80000,25,,RUE DU MOULIN,0072,17470,17473,Villemorin,17,,,17473000ZA0119,,,,,,,,,,,,,0,1,Maison,75,3,S,sols,,,953,-0.290539,46.001263
2020-222755,2020-12-23,000001,Vente,25000,3,,RUE DE LA CORDONNERIE,0020,17470,17473,Villemorin,17,,,174730000A0213,,,,,,,,,,,,,0,3,Dépendance,,0,S,sols,,,804,-0.295283,46.003936
2020-222755,2020-12-23,000001,Vente,25000,3,,RUE DE LA CORDONNERIE,0020,17470,17473,Villemorin,17,,,174730000A0213,,,,,,,,,,,,,0,1,Maison,141,7,S,sols,,,804,-0.295283,46.003936
2020-222755,2020-12-23,000001,Vente,25000,3,,RUE DE LA CORDONNERIE,0020,17470,17473,Villemorin,17,,,174730000A0213,,,,,,,,,,,,,0,3,Dépendance,,0,S,sols,,,804,-0.295283,46.003936
