id_mutation,date_mutation,numero_disposition,nature_mutation,valeur_fonciere,adresse_numero,adresse_suffixe,adresse_nom_voie,adresse_code_voie,code_postal,code_commune,nom_commune,code_departement,ancien_code_commune,ancien_nom_commune,id_parcelle,ancien_id_parcelle,numero_volume,lot1_numero,lot1_surface_carrez,lot2_numero,lot2_surface_carrez,lot3_numero,lot3_surface_carrez,lot4_numero,lot4_surface_carrez,lot5_numero,lot5_surface_carrez,nombre_lots,code_type_local,type_local,surface_reelle_bati,nombre_pieces_principales,code_nature_culture,nature_culture,code_nature_culture_speciale,nature_culture_speciale,surface_terrain,longitude,latitude
2020-223681,2020-03-17,000001,Vente,13000,1,,RUE DE L EGLISE,0065,18310,18167,Nohant-en-Graçay,18,,,181670000B0190,,,,,,,,,,,,,0,1,Maison,120,5,S,sols,,,231,1.893815,47.136731
2020-223681,2020-03-17,000001,Vente,13000,,,LE BOURG,B021,18310,18167,Nohant-en-Graçay,18,,,181670000B0220,,,,,,,,,,,,,0,,,,,J,jardins,,,120,1.894698,47.135494
2020-224500,2020-06-26,000001,Vente,40000,1,,RLE SAINT MARTIN,0170,18310,18167,Nohant-en-Graçay,18,,,181670000B0186,,,,,,,,,,,,,0,1,Maison,70,3,S,sols,,,179,1.893335,47.136453
2020-224500,2020-06-26,000001,Vente,40000,1,,RLE SAINT MARTIN,0170,18310,18167,Nohant-en-Graçay,18,,,181670000B0186,,,,,,,,,,,,,0,1,Maison,70,3,AG,terrains d'agrément,,,182,1.893335,47.136453
2020-225885,2020-10-24,000001,Vente,165000,,,LE BOURG,B021,18310,18167,Nohant-en-Graçay,18,,,181670000B0287,,,,,,,,,,,,,0,,,,,S,sols,,,634,1.895586,47.136963
2020-225885,2020-10-24,000001,Vente,165000,7,,RTE DE DAMPIERRE,0050,18310,18167,Nohant-en-Graçay,18,,,181670000B0320,,,,,,,,,,,,,0,1,Maison,136,7,S,sols,,,820,1.895234,47.137609
2020-225885,2020-10-24,000001,Vente,165000,,,LE BOURG,B021,18310,18167,Nohant-en-Graçay,18,,,181670000B0321,,,,,,,,,,,,,0,,,,,S,sols,,,300,1.89545,47.137412
2020-225885,2020-10-24,000001,Vente,165000,,,LE BOURG,B021,18310,18167,Nohant-en-Graçay,18,,,181670000B0321,,,,,,,,,,,,,0,,,,,AG,terrains d'agrément,,,2182,1.89545,47.137412
2020-226191,2020-11-14,000001,Vente,1300,49,C,LE BOURG,B021,18310,18167,Nohant-en-Graçay,18,,,181670000B0540,,,,,,,,,,,,,0,3,Dépendance,,0,S,sols,,,16,1.895122,47.136414
2020-226191,2020-11-14,000001,Vente,1300,49,C,LE BOURG,B021,18310,18167,Nohant-en-Graçay,18,,,181670000B0540,,,,,,,,,,,,,0,3,Dépendance,,0,J,jardins,,,355,1.895122,47.136414
2020-226245,2020-11-20,000001,Vente,1584,,,TAILLES DU VERGER,B137,18310,18167,Nohant-en-Graçay,18,,,181670000B0094,,,,,,,,,,,,,0,,,,,BS,taillis sous futaie,,,4150,1.904638,47.139295
2020-226245,2020-11-20,000001,Vente,1584,,,LE VERGER,B154,18310,18167,Nohant-en-Graçay,18,,,181670000B0128,,,,,,,,,,,,,0,,,,,BS,taillis sous futaie,,,390,1.904095,47.139899
2020-226254,2020-11-17,000001,Vente,76000,,,LA PERINERIE,B095,18310,18167,Nohant-en-Graçay,18,,,181670000A0089,,,,,,,,,,,,,0,,,,,T,terres,,,760,1.924186,47.149396
2020-226254,2020-11-17,000001,Vente,76000,,,LA PERINERIE,B095,18310,18167,Nohant-en-Graçay,18,,,181670000A0090,,,,,,,,,,,,,0,,,,,T,terres,,,1520,1.92427,47.14956
2020-226254,2020-11-17,000001,Vente,76000,,,LA PERINERIE,B095,18310,18167,Nohant-en-Graçay,18,,,181670000A0091,,,,,,,,,,,,,0,,,,,T,terres,,,1605,1.92435,47.149966
2020-226254,2020-11-17,000001,Vente,76000,,,LA PERINERIE,B095,18310,18167,Nohant-en-Graçay,18,,,181670000A0093,,,,,,,,,,,,,0,,,,,E,eaux,MARE,Mare,1480,1.924234,47.149991
2020-226254,2020-11-17,000001,Vente,76000,113,,LA PERINERIE,B095,18310,18167,Nohant-en-Graçay,18,,,181670000A0094,,,,,,,,,,,,,0,1,Maison,106,5,S,sols,,,1430,1.924485,47.150328
2020-226254,2020-11-17,000001,Vente,76000,,,LA PERINERIE,B095,18310,18167,Nohant-en-Graçay,18,,,181670000A0096,,,,,,,,,,,,,0,,,,,S,sols,,,2130,1.924404,47.150724
2020-226254,2020-11-17,000001,Vente,76000,,,LA PERINERIE,B095,18310,18167,Nohant-en-Graçay,18,,,181670000A0263,,,,,,,,,,,,,0,,,,,T,terres,,,2125,1.924316,47.150853
2020-226254,2020-11-17,000001,Vente,76000,,,LA PERINERIE,B095,18310,18167,Nohant-en-Graçay,18,,,181670000A0263,,,,,,,,,,,,,0,,,,,S,sols,,,319,1.924316,47.150853
2020-226619,2020-11-26,000001,Vente,163000,,,LES CHAMPS DE DEVANT,B038,18310,18167,Nohant-en-Graçay,18,,,18167000ZE0002,,,,,,,,,,,,,0,,,,,T,terres,,,350,1.882393,47.138775
2020-226619,2020-11-26,000001,Vente,163000,,,LES CHAMPS DE DEVANT,B038,18310,18167,Nohant-en-Graçay,18,,,18167000ZE0092,,,,,,,,,,,,,0,,,,,T,terres,,,2019,1.881957,47.13895
2020-226619,2020-11-26,000001,Vente,163000,,,LES CHAMPS DE DEVANT,B038,18310,18167,Nohant-en-Graçay,18,,,18167000ZE0093,,,,,,,,,,,,,0,,,,,S,sols,,,1100,1.882446,47.138517
2020-226667,2020-12-22,000001,Vente,150000,,,LA GARENNE,B057,18310,18167,Nohant-en-Graçay,18,,,181670000A0042,,,,,,,,,,,,,0,,,,,BS,taillis sous futaie,,,32595,1.909037,47.157157
2020-226667,2020-12-22,000001,Vente,150000,,,LA GARENNE,B057,18310,18167,Nohant-en-Graçay,18,,,181670000A0042,,,,,,,,,,,,,0,,,,,BS,taillis sous futaie,,,32595,1.909037,47.157157
2020-226667,2020-12-22,000001,Vente,150000,,,LA GARENNE,B057,18310,18167,Nohant-en-Graçay,18,,,181670000A0043,,,,,,,,,,,,,0,,,,,T,terres,,,65150,1.910916,47.156119
2020-226667,2020-12-22,000001,Vente,150000,,,CHAMP ROUSE,B037,18310,18167,Nohant-en-Graçay,18,,,181670000A0196,,,,,,,,,,,,,0,,,,,T,terres,,,127110,1.912851,47.15763
2020-226667,2020-12-22,000001,Vente,150000,,,CHAMP ROUSE,B037,18310,18167,Nohant-en-Graçay,18,,,181670000A0196,,,,,,,,,,,,,0,,,,,T,terres,,,42370,1.912851,47.15763
2020-226889,2020-12-29,000001,Vente,1462,,,TAILLES DU VERGER,B137,18310,18167,Nohant-en-Graçay,18,,,181670000B0095,,,,,,,,,,,,,0,,,,,BS,taillis sous futaie,,,3900,1.904536,47.138955
2020-226889,2020-12-29,000001,Vente,1462,,,LE VERGER,B154,18310,18167,Nohant-en-Graçay,18,,,181670000B0127,,,,,,,,,,,,,0,,,,,BS,taillis sous futaie,,,275,1.903808,47.139771
