id_mutation,date_mutation,numero_disposition,nature_mutation,valeur_fonciere,adresse_numero,adresse_suffixe,adresse_nom_voie,adresse_code_voie,code_postal,code_commune,nom_commune,code_departement,ancien_code_commune,ancien_nom_commune,id_parcelle,ancien_id_parcelle,numero_volume,lot1_numero,lot1_surface_carrez,lot2_numero,lot2_surface_carrez,lot3_numero,lot3_surface_carrez,lot4_numero,lot4_surface_carrez,lot5_numero,lot5_surface_carrez,nombre_lots,code_type_local,type_local,surface_reelle_bati,nombre_pieces_principales,code_nature_culture,nature_culture,code_nature_culture_speciale,nature_culture_speciale,surface_terrain,longitude,latitude
2020-230227,2020-02-21,000001,Vente,450000,,,L AUVERGNASSOU,B001,19430,19017,Bassignac-le-Bas,19,,,19017000AH0077,,,,,,,,,,,,,0,,,,,BT,taillis simples,,,315,1.885233,45.016406
2020-230227,2020-02-21,000001,Vente,450000,,,L AUVERGNASSOU,B001,19430,19017,Bassignac-le-Bas,19,,,19017000AH0078,,,,,,,,,,,,,0,,,,,BT,taillis simples,,,11183,1.886134,45.016133
2020-230227,2020-02-21,000001,Vente,450000,,,L AUVERGNASSOU,B001,19430,19017,Bassignac-le-Bas,19,,,19017000AH0086,,,,,,,,,,,,,0,,,,,BR,futaies résineuses,,,5275,1.887193,45.015901
2020-230227,2020-02-21,000001,Vente,450000,,,L AUVERGNASSOU,B001,19430,19017,Bassignac-le-Bas,19,,,19017000AH0087,,,,,,,,,,,,,0,,,,,BR,futaies résineuses,,,2449,1.887642,45.015849
2020-230228,2020-02-21,000001,Vente,6000,,,AUX CABANES,B015,19430,19017,Bassignac-le-Bas,19,,,19017000AK0002,,,,,,,,,,,,,0,,,,,BT,taillis simples,,,2830,1.861592,45.01749
2020-230228,2020-02-21,000001,Vente,6000,,,AUX CABANES,B015,19430,19017,Bassignac-le-Bas,19,,,19017000AK0004,,,,,,,,,,,,,0,,,,,BR,futaies résineuses,,,3825,1.861352,45.01655
2020-230228,2020-02-21,000001,Vente,6000,,,LE PUY LAURIER,B058,19430,19017,Bassignac-le-Bas,19,,,19017000AM0002,,,,,,,,,,,,,0,,,,,BT,taillis simples,,,1590,1.861227,45.017478
2020-230228,2020-02-21,000001,Vente,6000,,,LE PUY LAURIER,B058,19430,19017,Bassignac-le-Bas,19,,,19017000AM0003,,,,,,,,,,,,,0,,,,,S,sols,,,62,1.861212,45.017269
2020-230228,2020-02-21,000001,Vente,6000,,,LE PUY LAURIER,B058,19430,19017,Bassignac-le-Bas,19,,,19017000AM0005,,,,,,,,,,,,,0,,,,,BT,taillis simples,,,1275,1.861181,45.01594
2020-230798,2020-05-29,000001,Vente,400,,,CULOGNE,B028,19430,19017,Bassignac-le-Bas,19,,,19017000AB0154,,,,,,,,,,,,,0,,,,,T,terres,,,570,1.86367,45.035304
2020-231554,2020-09-25,000001,Vente,56200,,,AUX CABANES,B015,19430,19017,Bassignac-le-Bas,19,,,19017000AK0020,,,,,,,,,,,,,0,,,,,BT,taillis simples,,,14180,1.865941,45.014482
2020-231554,2020-09-25,000001,Vente,56200,5096,,AUX CABANES,B015,19430,19017,Bassignac-le-Bas,19,,,19017000AK0021,,,,,,,,,,,,,0,1,Maison,50,1,S,sols,,,51,1.86537,45.01453
2020-231554,2020-09-25,000001,Vente,56200,,,AUX CABANES,B015,19430,19017,Bassignac-le-Bas,19,,,19017000AK0022,,,,,,,,,,,,,0,,,,,BT,taillis simples,,,8195,1.864914,45.014644
2020-231554,2020-09-25,000001,Vente,56200,,,AUX CABANES,B015,19430,19017,Bassignac-le-Bas,19,,,19017000AK0023,,,,,,,,,,,,,0,,,,,PC,pacages,,,5065,1.866526,45.014389
2020-231554,2020-09-25,000001,Vente,56200,,,AUX CABANES,B015,19430,19017,Bassignac-le-Bas,19,,,19017000AK0024,,,,,,,,,,,,,0,,,,,PC,pacages,,,2128,1.866091,45.014969
2020-231557,2020-09-25,000001,Vente,172000,,,LE MOULIN DE LA BORIE,B042,19430,19017,Bassignac-le-Bas,19,,,19017000AI0248,,,,,,,,,,,,,0,,,,,L,landes,BRUY,Bruyère,1260,1.864188,45.018669
2020-231557,2020-09-25,000001,Vente,172000,5032,,LE MOULIN DE LA BORIE,B042,19430,19017,Bassignac-le-Bas,19,,,19017000AI0249,,,,,,,,,,,,,0,1,Maison,80,3,S,sols,,,555,1.863602,45.018455
2020-231557,2020-09-25,000001,Vente,172000,,,AUX CABANES,B015,19430,19017,Bassignac-le-Bas,19,,,19017000AK0014,,,,,,,,,,,,,0,,,,,S,sols,,,40,1.863343,45.018337
2020-231557,2020-09-25,000001,Vente,172000,,,AUX CABANES,B015,19430,19017,Bassignac-le-Bas,19,,,19017000AK0015,,,,,,,,,,,,,0,,,,,S,sols,,,51,1.863287,45.017962
2020-231557,2020-09-25,000001,Vente,172000,,,AUX CABANES,B015,19430,19017,Bassignac-le-Bas,19,,,19017000AK0141,,,,,,,,,,,,,0,,,,,BT,taillis simples,,,800,1.863308,45.018406
2020-231557,2020-09-25,000001,Vente,172000,,,AUX CABANES,B015,19430,19017,Bassignac-le-Bas,19,,,19017000AK0143,,,,,,,,,,,,,0,,,,,BT,taillis simples,,,1048,1.863483,45.01812
2020-231557,2020-09-25,000001,Vente,172000,,,AUX CABANES,B015,19430,19017,Bassignac-le-Bas,19,,,19017000AK0145,,,,,,,,,,,,,0,,,,,BT,taillis simples,,,22,1.863823,45.0184
2020-231854,2020-10-29,000001,Vente,90000,,,CHAVIOLLE,B024,19430,19017,Bassignac-le-Bas,19,,,19017000AI0055,,,,,,,,,,,,,0,,,,,P,prés,,,790,1.866279,45.022537
2020-231854,2020-10-29,000001,Vente,90000,5023,,CHAVIOLLE,B024,19430,19017,Bassignac-le-Bas,19,,,19017000AI0057,,,,,,,,,,,,,0,1,Maison,58,3,S,sols,,,695,1.86596,45.022773
2020-231854,2020-10-29,000001,Vente,90000,,,CHAVIOLLE,B024,19430,19017,Bassignac-le-Bas,19,,,19017000AI0068,,,,,,,,,,,,,0,,,,,S,sols,,,184,1.86573,45.022487
2020-231854,2020-10-29,000001,Vente,90000,,,LA PRADE,B050,19430,19017,Bassignac-le-Bas,19,,,19017000AI0148,,,,,,,,,,,,,0,,,,,BR,futaies résineuses,,,2825,1.877899,45.022824
2020-231854,2020-10-29,000001,Vente,90000,,,LA PRADE,B050,19430,19017,Bassignac-le-Bas,19,,,19017000AI0152,,,,,,,,,,,,,0,,,,,L,landes,BRUY,Bruyère,945,1.877495,45.022633
2020-231854,2020-10-29,000001,Vente,90000,,,LA PRADE,B050,19430,19017,Bassignac-le-Bas,19,,,19017000AI0157,,,,,,,,,,,,,0,,,,,L,landes,BRUY,Bruyère,9565,1.878031,45.021837
2020-231854,2020-10-29,000001,Vente,90000,,,LE MOULIN DE LA BORIE,B042,19430,19017,Bassignac-le-Bas,19,,,19017000AI0253,,,,,,,,,,,,,0,,,,,L,landes,BRUY,Bruyère,6105,1.862901,45.019629
2020-231854,2020-10-29,000001,Vente,90000,,,CHAVIOLLE,B024,19430,19017,Bassignac-le-Bas,19,,,19017000AI0311,,,,,,,,,,,,,0,,,,,S,sols,,,139,1.866087,45.022691
2020-231854,2020-10-29,000001,Vente,90000,,,LE PUY LAURIER,B058,19430,19017,Bassignac-le-Bas,19,,,19017000AM0001,,,,,,,,,,,,,0,,,,,L,landes,BRUY,Bruyère,10365,1.861082,45.018219
2020-232199,2020-12-02,000001,Vente,600,,,MASCOMBET,B040,19430,19017,Bassignac-le-Bas,19,,,19017000AB0237,,,,,,,,,,,,,0,,,,,BT,taillis simples,,,126,1.863032,45.034734
2020-232199,2020-12-02,000001,Vente,600,,,LA TERRE DU DESSUS,B067,19430,19017,Bassignac-le-Bas,19,,,19017000AO0092,,,,,,,,,,,,,0,,,,,T,terres,,,1153,1.863265,45.034637
2020-232557,2020-12-17,000001,Vente,20000,5009,,RECOUDIE,B059,19430,19017,Bassignac-le-Bas,19,,,19017000AC0019,,,,,,,,,,,,,0,1,Maison,40,1,S,sols,,,335,1.872769,45.043011
