id_mutation,date_mutation,numero_disposition,nature_mutation,valeur_fonciere,adresse_numero,adresse_suffixe,adresse_nom_voie,adresse_code_voie,code_postal,code_commune,nom_commune,code_departement,ancien_code_commune,ancien_nom_commune,id_parcelle,ancien_id_parcelle,numero_volume,lot1_numero,lot1_surface_carrez,lot2_numero,lot2_surface_carrez,lot3_numero,lot3_surface_carrez,lot4_numero,lot4_surface_carrez,lot5_numero,lot5_surface_carrez,nombre_lots,code_type_local,type_local,surface_reelle_bati,nombre_pieces_principales,code_nature_culture,nature_culture,code_nature_culture_speciale,nature_culture_speciale,surface_terrain,longitude,latitude
2020-229798,2020-01-10,000001,Vente,59000,2,,RUE DES MESANGES,0043,19320,19125,Marcillac-la-Croisille,19,,,19125000BK0488,,,,,,,,,,,,,0,,,,,AB,terrains a bâtir,,,637,2.009008,45.264251
2020-229798,2020-01-10,000001,Vente,59000,11,,ALL DES ROSES,0048,19320,19125,Marcillac-la-Croisille,19,,,19125000BK0574,,1,,,,,,,,,,,0,,,,,,,,,,2.009117,45.264051
2020-229798,2020-01-10,000001,Vente,59000,11,,ALL DES ROSES,0048,19320,19125,Marcillac-la-Croisille,19,,,19125000BK0574,,3,,,,,,,,,,,0,,,,,,,,,,2.009117,45.264051
2020-229798,2020-01-10,000001,Vente,59000,11,,ALL DES ROSES,0048,19320,19125,Marcillac-la-Croisille,19,,,19125000BK0574,,5,,,,,,,,,,,0,,,,,,,,,,2.009117,45.264051
2020-229798,2020-01-10,000001,Vente,59000,11,,ALL DES ROSES,0048,19320,19125,Marcillac-la-Croisille,19,,,19125000BK0574,,7,,,,,,,,,,,0,,,,,,,,,,2.009117,45.264051
2020-229798,2020-01-10,000001,Vente,59000,11,,ALL DES ROSES,0048,19320,19125,Marcillac-la-Croisille,19,,,19125000BK0574,,9,,,,,,,,,,,0,,,,,,,,,,2.009117,45.264051
2020-229798,2020-01-10,000001,Vente,59000,11,,ALL DES ROSES,0048,19320,19125,Marcillac-la-Croisille,19,,,19125000BK0576,,,,,,,,,,,,,0,,,,,J,jardins,,,242,2.009045,45.264054
2020-229852,2020-01-20,000001,Vente,84000,1,,ALL DES CHALETS,0016,19320,19125,Marcillac-la-Croisille,19,,,19125000BK0519,,,,,,,,,,,,,0,1,Maison,71,4,S,sols,,,1164,2.008126,45.266026
2020-229901,2020-01-09,000001,Vente,200000,7,B,RUE DES MESANGES,0043,19320,19125,Marcillac-la-Croisille,19,,,19125000BK0550,,,,,,,,,,,,,0,1,Maison,106,4,AG,terrains d'agrément,PARC,Parc,571,2.009511,45.264869
2020-229901,2020-01-09,000001,Vente,200000,7,B,RUE DES MESANGES,0043,19320,19125,Marcillac-la-Croisille,19,,,19125000BK0550,,,,,,,,,,,,,0,1,Maison,106,4,S,sols,,,500,2.009511,45.264869
2020-229985,2020-01-23,000001,Vente,40000,14,,RUE DU PRE DE JEAN,0044,19320,19125,Marcillac-la-Croisille,19,,,19125000AI0102,,,,,,,,,,,,,0,1,Maison,70,5,S,sols,,,530,2.02959,45.273445
2020-230129,2020-02-12,000001,Vente,49000,10,,RUE DU PRE DE JEAN,0044,19320,19125,Marcillac-la-Croisille,19,,,19125000AI0094,,,,,,,,,,,,,0,2,Appartement,82,4,S,sols,,,1712,2.03011,45.273785
2020-230129,2020-02-12,000001,Vente,49000,10,,RUE DU PRE DE JEAN,0044,19320,19125,Marcillac-la-Croisille,19,,,19125000AI0094,,,,,,,,,,,,,0,2,Appartement,82,4,S,sols,,,1712,2.03011,45.273785
2020-230163,2020-02-17,000001,Vente,48000,,,NOUGEIN,B118,19320,19125,Marcillac-la-Croisille,19,,,19125000AW0074,,,,,,,,,,,,,0,,,,,T,terres,,,477,2.04681,45.225303
2020-230163,2020-02-17,000001,Vente,48000,,,NOUGEIN,B118,19320,19125,Marcillac-la-Croisille,19,,,19125000AW0075,,,,,,,,,,,,,0,,,,,S,sols,,,93,2.046734,45.225384
2020-230163,2020-02-17,000001,Vente,48000,5345,,NOUGEIN,B118,19320,19125,Marcillac-la-Croisille,19,,,19125000AW0079,,,,,,,,,,,,,0,1,Maison,45,3,S,sols,,,80,2.045704,45.225348
2020-230163,2020-02-17,000001,Vente,48000,,,NOUGEIN,B118,19320,19125,Marcillac-la-Croisille,19,,,19125000AW0154,,,,,,,,,,,,,0,,,,,S,sols,,,2,2.045881,45.225433
2020-230163,2020-02-17,000001,Vente,48000,,,NOUGEIN,B118,19320,19125,Marcillac-la-Croisille,19,,,19125000AW0156,,,,,,,,,,,,,0,,,,,S,sols,,,41,2.045874,45.225477
2020-230163,2020-02-17,000001,Vente,48000,,,NOUGEIN,B118,19320,19125,Marcillac-la-Croisille,19,,,19125000AW0157,,,,,,,,,,,,,0,,,,,S,sols,,,7,2.045813,45.225454
2020-230163,2020-02-17,000001,Vente,48000,,,NOUGEIN,B118,19320,19125,Marcillac-la-Croisille,19,,,19125000AW0161,,,,,,,,,,,,,0,,,,,S,sols,,,21,2.045855,45.225505
2020-230318,2020-02-28,000001,Vente,15000,8,,ALL DES FOUGERES,0032,19320,19125,Marcillac-la-Croisille,19,,,19125000BK0423,,,,,,,,,,,,,0,,,,,AB,terrains a bâtir,,,1127,2.005835,45.265741
2020-230327,2020-03-02,000002,Vente,200,,,BOURNOL HAUT,B025,19320,19125,Marcillac-la-Croisille,19,,,19125000AO0406,,,,,,,,,,,,,0,,,,,T,terres,,,181,2.024611,45.25354
2020-230439,2020-04-22,000001,Vente,14000,,,MALEZE,B104,19320,19125,Marcillac-la-Croisille,19,,,19125000AB0255,,,,,,,,,,,,,0,,,,,S,sols,,,252,2.001985,45.276266
2020-230451,2020-04-29,000001,Vente,154850,,,LE MONS,B112,19320,19125,Marcillac-la-Croisille,19,,,19125000AN0216,,,,,,,,,,,,,0,,,,,BT,taillis simples,,,659,2.028345,45.25723
2020-230451,2020-04-29,000001,Vente,154850,,,LE MONS,B112,19320,19125,Marcillac-la-Croisille,19,,,19125000AN0217,,,,,,,,,,,,,0,,,,,BT,taillis simples,,,18,2.028481,45.257096
2020-230451,2020-04-29,000001,Vente,154850,,,LE MONS,B112,19320,19125,Marcillac-la-Croisille,19,,,19125000AN0218,,,,,,,,,,,,,0,,,,,T,terres,,,787,2.028065,45.257238
2020-230451,2020-04-29,000001,Vente,154850,5511,,LE MONS,B112,19320,19125,Marcillac-la-Croisille,19,,,19125000AN0219,,,,,,,,,,,,,0,1,Maison,90,3,S,sols,,,500,2.028287,45.256972
2020-230451,2020-04-29,000001,Vente,154850,5511,,LE MONS,B112,19320,19125,Marcillac-la-Croisille,19,,,19125000AN0219,,,,,,,,,,,,,0,3,Dépendance,,0,S,sols,,,500,2.028287,45.256972
2020-230451,2020-04-29,000001,Vente,154850,5511,,LE MONS,B112,19320,19125,Marcillac-la-Croisille,19,,,19125000AN0219,,,,,,,,,,,,,0,1,Maison,90,3,T,terres,,,1982,2.028287,45.256972
2020-230451,2020-04-29,000001,Vente,154850,5511,,LE MONS,B112,19320,19125,Marcillac-la-Croisille,19,,,19125000AN0219,,,,,,,,,,,,,0,3,Dépendance,,0,T,terres,,,1982,2.028287,45.256972
2020-230804,2020-06-16,000001,Vente,50000,2,,ALL DES BOULEAUX,0012,19320,19125,Marcillac-la-Croisille,19,,,19125000BK0492,,,,,,,,,,,,,0,1,Maison,45,2,S,sols,,,706,2.008772,45.264977
2020-231043,2020-07-29,000001,Vente,1500,,,LE MONS,B112,19320,19125,Marcillac-la-Croisille,19,,,19125000AN0300,,,,,,,,,,,,,0,,,,,T,terres,,,2671,2.02819,45.256366
2020-231043,2020-07-29,000001,Vente,1500,,,LE MONS,B112,19320,19125,Marcillac-la-Croisille,19,,,19125000AN0301,,,,,,,,,,,,,0,,,,,T,terres,,,44,2.027898,45.256181
2020-231238,2020-08-04,000001,Vente,7000,,,CHAMPS REDON,B037,19320,19125,Marcillac-la-Croisille,19,,,19125000AC0086,,,,,,,,,,,,,0,,,,,BR,futaies résineuses,,,4195,2.002627,45.272318
2020-231254,2020-08-04,000001,Vente,5000,,,MALEZE,B104,19320,19125,Marcillac-la-Croisille,19,,,19125000AB0243,,,,,,,,,,,,,0,,,,,BR,futaies résineuses,,,3195,2.003276,45.275621
2020-231254,2020-08-04,000001,Vente,5000,,,CHAMPS REDON,B037,19320,19125,Marcillac-la-Croisille,19,,,19125000AC0104,,,,,,,,,,,,,0,,,,,BS,taillis sous futaie,,,4395,2.004107,45.274541
2020-231254,2020-08-04,000001,Vente,5000,,,CHAMPS REDON,B037,19320,19125,Marcillac-la-Croisille,19,,,19125000AC0420,,,,,,,,,,,,,0,,,,,BR,futaies résineuses,,,6560,2.004177,45.275138
2020-231254,2020-08-04,000001,Vente,5000,,,CHAMPS REDON,B037,19320,19125,Marcillac-la-Croisille,19,,,19125000AC0420,,,,,,,,,,,,,0,,,,,BT,taillis simples,,,6318,2.004177,45.275138
2020-231406,2020-08-27,000001,Vente,97000,,,FONTEILLE,B076,19320,19125,Marcillac-la-Croisille,19,,,19125000AS0081,,,,,,,,,,,,,0,,,,,BT,taillis simples,,,1008,2.051182,45.245247
2020-231406,2020-08-27,000001,Vente,97000,,,LE PUY DE SALUT,B146,19320,19125,Marcillac-la-Croisille,19,,,19125000AT0035,,,,,,,,,,,,,0,,,,,L,landes,BRUY,Bruyère,352,2.059959,45.243116
2020-231406,2020-08-27,000001,Vente,97000,,,LE PUY DE SALUT,B146,19320,19125,Marcillac-la-Croisille,19,,,19125000AT0037,,,,,,,,,,,,,0,,,,,L,landes,BRUY,Bruyère,1923,2.06032,45.24357
2020-231406,2020-08-27,000001,Vente,97000,,,LE PUY DE SALUT,B146,19320,19125,Marcillac-la-Croisille,19,,,19125000AT0039,,,,,,,,,,,,,0,,,,,L,landes,BRUY,Bruyère,5510,2.061595,45.244824
2020-231406,2020-08-27,000001,Vente,97000,,,LES SECHOIRS,B162,19320,19125,Marcillac-la-Croisille,19,,,19125000AT0084,,,,,,,,,,,,,0,,,,,BS,taillis sous futaie,,,416,2.063767,45.239072
2020-231406,2020-08-27,000001,Vente,97000,,,LESTRADE,B103,19320,19125,Marcillac-la-Croisille,19,,,19125000AT0157,,,,,,,,,,,,,0,,,,,BS,taillis sous futaie,,,10780,2.062295,45.235895
2020-231406,2020-08-27,000001,Vente,97000,5332,,VERGNE,B175,19320,19125,Marcillac-la-Croisille,19,,,19125000AT0293,,,,,,,,,,,,,0,1,Maison,94,6,S,sols,,,690,2.056708,45.239701
2020-231406,2020-08-27,000001,Vente,97000,,,VERGNE,B175,19320,19125,Marcillac-la-Croisille,19,,,19125000AT0322,,,,,,,,,,,,,0,,,,,P,prés,,,1806,2.056425,45.23984
2020-231406,2020-08-27,000001,Vente,97000,,,RIAL CHARRAU,B155,19320,19125,Marcillac-la-Croisille,19,,,191250000B0247,,,,,,,,,,,,,0,,,,,BS,taillis sous futaie,,,12410,2.058764,45.247116
2020-231406,2020-08-27,000001,Vente,97000,,,LES MOULINS,B116,19320,19125,Marcillac-la-Croisille,19,,,191250000G0031,,,,,,,,,,,,,0,,,,,BT,taillis simples,,,1540,2.053308,45.233261
2020-231406,2020-08-27,000001,Vente,97000,,,LES MOULINS,B116,19320,19125,Marcillac-la-Croisille,19,,,191250000G0038,,,,,,,,,,,,,0,,,,,BT,taillis simples,,,4090,2.054376,45.23228
2020-231406,2020-08-27,000001,Vente,97000,,,PUY LARODE,B150,19320,19125,Marcillac-la-Croisille,19,,,191250000G0113,,,,,,,,,,,,,0,,,,,BT,taillis simples,,,5600,2.06657,45.22492
2020-231406,2020-08-27,000001,Vente,97000,,,LES SECHOIRS,B162,19320,19125,Marcillac-la-Croisille,19,,,191250000G0273,,,,,,,,,,,,,0,,,,,BT,taillis simples,,,1030,2.064502,45.232322
2020-231406,2020-08-27,000001,Vente,97000,,,LES SECHOIRS,B162,19320,19125,Marcillac-la-Croisille,19,,,191250000G0313,,,,,,,,,,,,,0,,,,,BT,taillis simples,,,4170,2.06835,45.231509
2020-231406,2020-08-27,000001,Vente,97000,,,LES SECHOIRS,B162,19320,19125,Marcillac-la-Croisille,19,,,191250000G0396,,,,,,,,,,,,,0,,,,,BT,taillis simples,,,2210,2.067779,45.22647
2020-231406,2020-08-27,000001,Vente,97000,,,LES SECHOIRS,B162,19320,19125,Marcillac-la-Croisille,19,,,191250000G0409,,,,,,,,,,,,,0,,,,,BT,taillis simples,,,3110,2.069766,45.227145
2020-231406,2020-08-27,000001,Vente,97000,,,LES SECHOIRS,B162,19320,19125,Marcillac-la-Croisille,19,,,191250000G0428,,,,,,,,,,,,,0,,,,,BT,taillis simples,,,6250,2.071407,45.228391
2020-231406,2020-08-27,000001,Vente,97000,,,COMBES CORPS,B056,19320,19125,Marcillac-la-Croisille,19,,,191250000G0490,,,,,,,,,,,,,0,,,,,BT,taillis simples,,,8570,2.063592,45.223927
2020-231424,2020-08-21,000001,Vente,50000,9,,RUE DES HORTS,0036,19320,19125,Marcillac-la-Croisille,19,,,19125000AK0110,,,,,,,,,,,,,0,1,Maison,75,3,S,sols,,,599,2.03209,45.272157
2020-231575,2020-09-02,000001,Vente,100000,1,,ALL DES BOULEAUX,0012,19320,19125,Marcillac-la-Croisille,19,,,19125000BK0493,,,,,,,,,,,,,0,1,Maison,51,2,S,sols,,,821,2.008671,45.265267
2020-231595,2020-09-11,000002,Vente,16000,,,CHINIAC,B050,19320,19125,Marcillac-la-Croisille,19,,,191250000B0634,,,,,,,,,,,,,0,,,,,AB,terrains a bâtir,,,2165,2.041151,45.278611
2020-231595,2020-09-11,000002,Vente,16000,,,CHINIAC,B050,19320,19125,Marcillac-la-Croisille,19,,,191250000B0637,,,,,,,,,,,,,0,,,,,T,terres,,,82,2.041243,45.278435
2020-231757,2020-09-28,000001,Vente,44247,,,FONTANIERE,B075,19320,19125,Marcillac-la-Croisille,19,,,19125000AY0161,,,,,,,,,,,,,0,,,,,BR,futaies résineuses,,,1820,2.013387,45.232081
2020-231757,2020-09-28,000001,Vente,44247,,,FONTANIERE,B075,19320,19125,Marcillac-la-Croisille,19,,,19125000AY0163,,,,,,,,,,,,,0,,,,,BR,futaies résineuses,,,3747,2.015149,45.23232
2020-231757,2020-09-28,000001,Vente,44247,,,FONTANIERE,B075,19320,19125,Marcillac-la-Croisille,19,,,19125000AY0164,,,,,,,,,,,,,0,,,,,BR,futaies résineuses,,,3283,2.014739,45.231524
2020-231770,2020-10-20,000001,Vente,3000,,,CHINIAC,B050,19320,19125,Marcillac-la-Croisille,19,,,191250000B0635,,,,,,,,,,,,,0,,,,,AB,terrains a bâtir,,,1832,2.041882,45.278703
2020-231770,2020-10-20,000001,Vente,3000,,,CHINIAC,B050,19320,19125,Marcillac-la-Croisille,19,,,191250000B0638,,,,,,,,,,,,,0,,,,,AB,terrains a bâtir,,,41,2.041621,45.278471
2020-231780,2020-10-20,000001,Vente,60000,,,CHINIAC,B050,19320,19125,Marcillac-la-Croisille,19,,,191250000B0488,,,,,,,,,,,,,0,,,,,BT,taillis simples,,,347,2.042523,45.278251
2020-231780,2020-10-20,000001,Vente,60000,,,CHINIAC,B050,19320,19125,Marcillac-la-Croisille,19,,,191250000B0489,,,,,,,,,,,,,0,,,,,BT,taillis simples,,,120,2.041978,45.278544
2020-231780,2020-10-20,000001,Vente,60000,,,CHINIAC,B050,19320,19125,Marcillac-la-Croisille,19,,,191250000B0491,,,,,,,,,,,,,0,,,,,BT,taillis simples,,,9,2.04084,45.278413
2020-231780,2020-10-20,000001,Vente,60000,5225,A,CHINIAC,B050,19320,19125,Marcillac-la-Croisille,19,,,191250000B0493,,,,,,,,,,,,,0,1,Maison,63,3,S,sols,,,139,2.041731,45.278439
2020-231780,2020-10-20,000001,Vente,60000,5225,A,CHINIAC,B050,19320,19125,Marcillac-la-Croisille,19,,,191250000B0493,,,,,,,,,,,,,0,3,Dépendance,,0,S,sols,,,139,2.041731,45.278439
2020-231780,2020-10-20,000001,Vente,60000,,,CHINIAC,B050,19320,19125,Marcillac-la-Croisille,19,,,191250000B0632,,,,,,,,,,,,,0,,,,,T,terres,,,3673,2.041645,45.278362
2020-231851,2020-10-09,000002,Vente,4000,,,CHASTAGNER,B043,19320,19125,Marcillac-la-Croisille,19,,,19125000AN0327,,,,,,,,,,,,,0,,,,,L,landes,BRUY,Bruyère,441,2.034677,45.26467
2020-231851,2020-10-09,000002,Vente,4000,,,CHASTAGNER,B043,19320,19125,Marcillac-la-Croisille,19,,,19125000AN0328,,,,,,,,,,,,,0,,,,,BR,futaies résineuses,,,179,2.0348,45.264325
2020-231851,2020-10-09,000002,Vente,4000,,,CHASTAGNER,B043,19320,19125,Marcillac-la-Croisille,19,,,19125000AN0330,,,,,,,,,,,,,0,,,,,T,terres,,,61,2.034,45.263651
2020-231859,2020-10-13,000001,Vente,8000,,,LES BARRIERES,B010,19320,19125,Marcillac-la-Croisille,19,,,19125000BK0343,,,,,,,,,,,,,0,,,,,AB,terrains a bâtir,,,1057,2.015091,45.266332
2020-231860,2020-10-10,000001,Vente,92500,5776,,GOURMACHOU,B087,19320,19125,Marcillac-la-Croisille,19,,,19125000AC0453,,,,,,,,,,,,,0,1,Maison,55,2,S,sols,,,500,2.002228,45.269054
2020-231860,2020-10-10,000001,Vente,92500,5776,,GOURMACHOU,B087,19320,19125,Marcillac-la-Croisille,19,,,19125000AC0453,,,,,,,,,,,,,0,1,Maison,55,2,AG,terrains d'agrément,PARC,Parc,298,2.002228,45.269054
2020-231864,2020-10-05,000001,Vente,81500,,,PRADEL,B134,19320,19125,Marcillac-la-Croisille,19,,,19125000AN0221,,,,,,,,,,,,,0,,,,,L,landes,BRUY,Bruyère,72,2.03167,45.269265
2020-231864,2020-10-05,000001,Vente,81500,19,,RUE DE L'ESCUROTTE,0026,19320,19125,Marcillac-la-Croisille,19,,,19125000AN0222,,,,,,,,,,,,,0,1,Maison,68,3,S,sols,,,188,2.031668,45.269197
2020-231864,2020-10-05,000001,Vente,81500,,,PRADEL,B134,19320,19125,Marcillac-la-Croisille,19,,,19125000AN0223,,,,,,,,,,,,,0,,,,,S,sols,,,80,2.031828,45.269191
2020-231864,2020-10-05,000001,Vente,81500,,,PRADEL,B134,19320,19125,Marcillac-la-Croisille,19,,,19125000AN0224,,,,,,,,,,,,,0,,,,,S,sols,,,185,2.031646,45.269143
2020-231864,2020-10-05,000001,Vente,81500,,,PRADEL,B134,19320,19125,Marcillac-la-Croisille,19,,,19125000AN0225,,,,,,,,,,,,,0,,,,,J,jardins,,,595,2.031696,45.269063
2020-231864,2020-10-05,000001,Vente,81500,,,PRADEL,B134,19320,19125,Marcillac-la-Croisille,19,,,19125000AN0226,,,,,,,,,,,,,0,,,,,J,jardins,,,215,2.031527,45.268783
2020-232100,2020-10-29,000001,Vente,5000,,,NOUGEIN,B118,19320,19125,Marcillac-la-Croisille,19,,,19125000AW0154,,,,,,,,,,,,,0,,,,,S,sols,,,2,2.045881,45.225433
2020-232100,2020-10-29,000001,Vente,5000,,,NOUGEIN,B118,19320,19125,Marcillac-la-Croisille,19,,,19125000AW0156,,,,,,,,,,,,,0,,,,,S,sols,,,41,2.045874,45.225477
2020-232100,2020-10-29,000001,Vente,5000,,,NOUGEIN,B118,19320,19125,Marcillac-la-Croisille,19,,,19125000AW0157,,,,,,,,,,,,,0,,,,,S,sols,,,7,2.045813,45.225454
2020-232100,2020-10-29,000001,Vente,5000,,,NOUGEIN,B118,19320,19125,Marcillac-la-Croisille,19,,,19125000AW0161,,,,,,,,,,,,,0,,,,,S,sols,,,21,2.045855,45.225505
2020-232174,2020-11-12,000001,Vente,3200,,,PUY D ELGOT,B141,19320,19125,Marcillac-la-Croisille,19,,,19125000AE0012,,,,,,,,,,,,,0,,,,,BT,taillis simples,,,980,2.011587,45.284151
2020-232174,2020-11-12,000001,Vente,3200,,,PUY D ELGOT,B141,19320,19125,Marcillac-la-Croisille,19,,,19125000AE0013,,,,,,,,,,,,,0,,,,,BT,taillis simples,,,975,2.011742,45.284307
2020-232174,2020-11-12,000001,Vente,3200,,,PUY D ELGOT,B141,19320,19125,Marcillac-la-Croisille,19,,,19125000AE0014,,,,,,,,,,,,,0,,,,,BT,taillis simples,,,1487,2.012023,45.284284
2020-232174,2020-11-12,000001,Vente,3200,,,PUY D ELGOT,B141,19320,19125,Marcillac-la-Croisille,19,,,19125000AE0015,,,,,,,,,,,,,0,,,,,BS,taillis sous futaie,,,1781,2.012211,45.28469
2020-232174,2020-11-12,000001,Vente,3200,,,PUY D ELGOT,B141,19320,19125,Marcillac-la-Croisille,19,,,19125000AE0016,,,,,,,,,,,,,0,,,,,BT,taillis simples,,,4014,2.01287,45.284618
2020-232174,2020-11-12,000001,Vente,3200,,,PUY D ELGOT,B141,19320,19125,Marcillac-la-Croisille,19,,,19125000AE0027,,,,,,,,,,,,,0,,,,,BT,taillis simples,,,3696,2.013551,45.284442
2020-232174,2020-11-12,000001,Vente,3200,,,PUY D ELGOT,B141,19320,19125,Marcillac-la-Croisille,19,,,19125000AE0028,,,,,,,,,,,,,0,,,,,BR,futaies résineuses,,,6447,2.013814,45.283698
2020-232174,2020-11-12,000001,Vente,3200,,,PUY D ELGOT,B141,19320,19125,Marcillac-la-Croisille,19,,,19125000AE0029,,,,,,,,,,,,,0,,,,,BS,taillis sous futaie,,,5076,2.014289,45.28412
2020-232174,2020-11-12,000001,Vente,3200,,,PUY D ELGOT,B141,19320,19125,Marcillac-la-Croisille,19,,,19125000AE0030,,,,,,,,,,,,,0,,,,,BR,futaies résineuses,,,5366,2.014897,45.284233
2020-232174,2020-11-12,000001,Vente,3200,,,PUY D ELGOT,B141,19320,19125,Marcillac-la-Croisille,19,,,19125000AE0031,,,,,,,,,,,,,0,,,,,BR,futaies résineuses,,,11670,2.015217,45.283046
2020-232305,2020-12-10,000001,Vente,9000,,,LES BARRIERES,B010,19320,19125,Marcillac-la-Croisille,19,,,19125000BK0342,,,,,,,,,,,,,0,,,,,AB,terrains a bâtir,,,1082,2.015365,45.266191
2020-232441,2020-12-16,000001,Vente,125000,3,,ALL DES ROSES,0048,19320,19125,Marcillac-la-Croisille,19,,,19125000BK0440,,,,,,,,,,,,,0,1,Maison,128,5,T,terres,,,798,2.008402,45.26388
2020-232441,2020-12-16,000001,Vente,125000,3,,ALL DES ROSES,0048,19320,19125,Marcillac-la-Croisille,19,,,19125000BK0440,,,,,,,,,,,,,0,1,Maison,128,5,S,sols,,,500,2.008402,45.26388
2020-232453,2020-12-16,000001,Vente,100000,,,LES BROUSSES,B029,19320,19125,Marcillac-la-Croisille,19,,,19125000AO0133,,,,,,,,,,,,,0,,,,,L,landes,BRUY,Bruyère,4510,2.03604,45.252592
2020-232453,2020-12-16,000001,Vente,100000,5460,,LES BROUSSES,B029,19320,19125,Marcillac-la-Croisille,19,,,19125000AO0134,,,,,,,,,,,,,0,1,Maison,75,2,S,sols,,,589,2.035628,45.252522
2020-232453,2020-12-16,000001,Vente,100000,,,LES BROUSSES,B029,19320,19125,Marcillac-la-Croisille,19,,,19125000AO0135,,,,,,,,,,,,,0,,,,,J,jardins,,,1044,2.035683,45.252257
2020-232453,2020-12-16,000001,Vente,100000,,,LES BROUSSES,B029,19320,19125,Marcillac-la-Croisille,19,,,19125000AO0136,,,,,,,,,,,,,0,,,,,L,landes,BRUY,Bruyère,2547,2.036964,45.252419
2020-232453,2020-12-16,000001,Vente,100000,,,LES BROUSSES,B029,19320,19125,Marcillac-la-Croisille,19,,,19125000AO0145,,,,,,,,,,,,,0,,,,,BR,futaies résineuses,,,4485,2.03469,45.252689
2020-232454,2020-12-15,000001,Vente,440,,,GOURMACHOU,B087,19320,19125,Marcillac-la-Croisille,19,,,19125000AC0425,,,,,,,,,,,,,0,,,,,S,sols,,,1973,2.001795,45.269663
2020-232455,2020-12-15,000001,Vente,600,,,GOURMACHOU,B087,19320,19125,Marcillac-la-Croisille,19,,,19125000AC0458,,,,,,,,,,,,,0,,,,,BR,futaies résineuses,,,2694,2.001625,45.269023
2020-232544,2020-12-18,000001,Vente,65000,5699,,LOT DE LANTOURNE,A001,19320,19125,Marcillac-la-Croisille,19,,,19125000BK0515,,,,,,,,,,,,,0,1,Maison,52,3,S,sols,,,1353,2.00897,45.26576
2020-232589,2020-12-28,000001,Vente,50000,,,AU FAURE,B073,19320,19125,Marcillac-la-Croisille,19,,,19125000AI0065,,,,,,,,,,,,,0,,,,,B,bois,,,1507,2.032352,45.276703
2020-232589,2020-12-28,000001,Vente,50000,,,AU FAURE,B073,19320,19125,Marcillac-la-Croisille,19,,,19125000AI0065,,,,,,,,,,,,,0,,,,,BR,futaies résineuses,,,11055,2.032352,45.276703
2020-232589,2020-12-28,000001,Vente,50000,,,AU FAURE,B073,19320,19125,Marcillac-la-Croisille,19,,,19125000AI0122,,,,,,,,,,,,,0,,,,,S,sols,,,67,2.03344,45.275211
2020-232589,2020-12-28,000001,Vente,50000,,,AU FAURE,B073,19320,19125,Marcillac-la-Croisille,19,,,19125000AI0168,,,,,,,,,,,,,0,,,,,T,terres,,,4550,2.033338,45.275641
2020-232589,2020-12-28,000001,Vente,50000,5270,,AU FAURE,B073,19320,19125,Marcillac-la-Croisille,19,,,19125000AI0170,,,,,,,,,,,,,0,1,Maison,135,4,S,sols,,,295,2.033443,45.275293
2020-232611,2020-12-30,000001,Vente,2000,,,LES TOURTEAUX,B169,19320,19125,Marcillac-la-Croisille,19,,,19125000AC0381,,,,,,,,,,,,,0,,,,,BS,taillis sous futaie,,,727,2.000547,45.274586
2020-232612,2020-12-30,000001,Vente,100,,,LES TOURTEAUX,B169,19320,19125,Marcillac-la-Croisille,19,,,19125000AC0378,,,,,,,,,,,,,0,,,,,BS,taillis sous futaie,,,200,2.000365,45.27481
2020-232614,2020-12-30,000001,Vente,3000,,,NOUGEIN,B118,19320,19125,Marcillac-la-Croisille,19,,,19125000AW0074,,,,,,,,,,,,,0,,,,,T,terres,,,477,2.04681,45.225303
2020-232614,2020-12-30,000001,Vente,3000,,,NOUGEIN,B118,19320,19125,Marcillac-la-Croisille,19,,,19125000AW0075,,,,,,,,,,,,,0,,,,,S,sols,,,93,2.046734,45.225384
