id_mutation,date_mutation,numero_disposition,nature_mutation,valeur_fonciere,adresse_numero,adresse_suffixe,adresse_nom_voie,adresse_code_voie,code_postal,code_commune,nom_commune,code_departement,ancien_code_commune,ancien_nom_commune,id_parcelle,ancien_id_parcelle,numero_volume,lot1_numero,lot1_surface_carrez,lot2_numero,lot2_surface_carrez,lot3_numero,lot3_surface_carrez,lot4_numero,lot4_surface_carrez,lot5_numero,lot5_surface_carrez,nombre_lots,code_type_local,type_local,surface_reelle_bati,nombre_pieces_principales,code_nature_culture,nature_culture,code_nature_culture_speciale,nature_culture_speciale,surface_terrain,longitude,latitude
2020-236192,2020-01-07,000001,Vente,18527.09,,,LE PRE BOURGEOT,B154,21350,21069,Beurizot,21,,,210690000D0195,,,,,,,,,,,,,0,,,,,P,prés,,,7730,4.484782,47.365025
2020-236196,2020-01-07,000001,Vente,5095.36,,,LA COMMAROT,B068,21350,21069,Beurizot,21,,,210690000D0067,,,,,,,,,,,,,0,,,,,P,prés,,,25,4.487962,47.367315
2020-237501,2020-02-19,000001,Vente,409,,,LA RAYE DROSSOT,B176,21350,21069,Beurizot,21,,,210690000B0114,,,,,,,,,,,,,0,,,,,P,prés,,,773,4.501271,47.349154
2020-237501,2020-02-19,000001,Vente,409,,,LA RAYE DROSSOT,B176,21350,21069,Beurizot,21,,,210690000B0115,,,,,,,,,,,,,0,,,,,P,prés,,,738,4.501284,47.349231
2020-237501,2020-02-19,000001,Vente,409,,,LA RAYE DROSSOT,B176,21350,21069,Beurizot,21,,,210690000B0116,,,,,,,,,,,,,0,,,,,T,terres,,,579,4.501907,47.348511
2020-237501,2020-02-19,000001,Vente,409,,,LA RAYE DROSSOT,B176,21350,21069,Beurizot,21,,,210690000B0117,,,,,,,,,,,,,0,,,,,BT,taillis simples,,,1450,4.502377,47.348429
2020-237501,2020-02-19,000001,Vente,409,,,CHAMP DE LA GRANGE DU BOUR,B039,21350,21069,Beurizot,21,,,210690000D0042,,,,,,,,,,,,,0,,,,,L,landes,,,240,4.497304,47.357555
2020-238678,2020-03-12,000001,Vente,20000,,,SUR SAINT ELOI,B181,21350,21069,Beurizot,21,,,210690000A0025,,,,,,,,,,,,,0,,,,,L,landes,,,2140,4.511893,47.369119
2020-238678,2020-03-12,000001,Vente,20000,,,LE TUA,B204,21350,21069,Beurizot,21,,,210690000A0215,,,,,,,,,,,,,0,,,,,BS,taillis sous futaie,,,29700,4.516011,47.353198
2020-238678,2020-03-12,000001,Vente,20000,,,LE TUA,B204,21350,21069,Beurizot,21,,,210690000A0216,,,,,,,,,,,,,0,,,,,BS,taillis sous futaie,,,15200,4.516276,47.354379
2020-238678,2020-03-12,000001,Vente,20000,,,LA CUERE,B076,21350,21069,Beurizot,21,,,210690000B0022,,,,,,,,,,,,,0,,,,,BT,taillis simples,ACACI,Acacias,3420,4.513839,47.353862
2020-238678,2020-03-12,000001,Vente,20000,,,LA CUERE,B076,21350,21069,Beurizot,21,,,210690000B0024,,,,,,,,,,,,,0,,,,,BS,taillis sous futaie,,,5408,4.514427,47.354232
2020-238678,2020-03-12,000001,Vente,20000,,,LA CUERE,B076,21350,21069,Beurizot,21,,,210690000B0025,,,,,,,,,,,,,0,,,,,BS,taillis sous futaie,,,7660,4.514462,47.353305
2020-239469,2020-04-24,000001,Vente,10644,,,LE CLOSEAU,B065,21350,21069,Beurizot,21,,,210690000B0210,,,,,,,,,,,,,0,,,,,P,prés,,,16750,4.497871,47.356045
2020-239469,2020-04-24,000001,Vente,10644,,,CHAMP DE LA GRANGE DU BOUR,B039,21350,21069,Beurizot,21,,,210690000D0044,,,,,,,,,,,,,0,,,,,P,prés,,,2035,4.497297,47.356722
2020-239469,2020-04-24,000001,Vente,10644,,,CHAMP DE LA GRANGE DU BOUR,B039,21350,21069,Beurizot,21,,,210690000D0045,,,,,,,,,,,,,0,,,,,P,prés,,,40020,4.496074,47.357594
2020-239469,2020-04-24,000001,Vente,10644,,,LA TRAMBLOT,B201,21350,21069,Beurizot,21,,,210690000D0159,,,,,,,,,,,,,0,,,,,P,prés,,,2946,4.487803,47.353372
2020-245730,2020-09-24,000001,Vente,10844,,,LA GRENOUILLERE,B107,21350,21069,Beurizot,21,,,210690000B0124,,,,,,,,,,,,,0,,,,,P,prés,,,22690,4.501029,47.350462
2020-245730,2020-09-24,000001,Vente,10844,,,LA GRENOUILLERE,B107,21350,21069,Beurizot,21,,,210690000B0125,,,,,,,,,,,,,0,,,,,P,prés,,,14290,4.503181,47.350603
2020-245730,2020-09-24,000001,Vente,10844,,,PRE GENDROT,B161,21350,21069,Beurizot,21,,,210690000B0182,,,,,,,,,,,,,0,,,,,P,prés,,,4700,4.501061,47.351183
2020-245730,2020-09-24,000001,Vente,10844,,,LE TRAVERS DES AUBUES,B202,21350,21069,Beurizot,21,,,210690000B0206,,,,,,,,,,,,,0,,,,,P,prés,,,17680,4.500871,47.353491
2020-245730,2020-09-24,000001,Vente,10844,,,LE VILLAGE,B215,21350,21069,Beurizot,21,,,210690000E0064,,,,,,,,,,,,,0,,,,,P,prés,,,3557,4.497824,47.351402
2020-247441,2020-10-30,000001,Vente,49440,,,LE BOIS DE MOUILLA,B024,21350,21069,Beurizot,21,,,210690000C0036,,,,,,,,,,,,,0,,,,,BS,taillis sous futaie,,,209490,4.474521,47.349435
2020-248024,2020-11-20,000001,Vente,163000,5007,,VERCHISY,B206,21350,21069,Beurizot,21,,,210690000C0074,,,,,,,,,,,,,0,1,Maison,90,2,S,sols,,,191,4.466836,47.35962
2020-248024,2020-11-20,000001,Vente,163000,,,VERCHISY,B206,21350,21069,Beurizot,21,,,210690000C0180,,,,,,,,,,,,,0,,,,,P,prés,,,1754,4.466833,47.359815
2020-248148,2020-11-10,000001,Vente,225200,,,LE BAS DU MONTOILLET,B013,21350,21069,Beurizot,21,,,210690000D0136,,,,,,,,,,,,,0,,,,,T,terres,,,440,4.488625,47.352488
2020-248148,2020-11-10,000001,Vente,225200,,,LE VILLAGE,B215,21350,21069,Beurizot,21,,,210690000E0122,,,,,,,,,,,,,0,,,,,P,prés,,,7592,4.491993,47.350079
2020-248148,2020-11-10,000001,Vente,225200,,,LE VILLAGE,B215,21350,21069,Beurizot,21,,,210690000E0123,,,,,,,,,,,,,0,,,,,J,jardins,,,600,4.492503,47.349493
2020-248148,2020-11-10,000001,Vente,225200,5072,,RUE FERRAND,0070,21350,21069,Beurizot,21,,,210690000E0124,,,,,,,,,,,,,0,1,Maison,140,4,S,sols,,,695,4.49267,47.349694
2020-248148,2020-11-10,000001,Vente,225200,5072,,RUE FERRAND,0070,21350,21069,Beurizot,21,,,210690000E0124,,,,,,,,,,,,,0,3,Dépendance,,0,S,sols,,,695,4.49267,47.349694
