id_mutation,date_mutation,numero_disposition,nature_mutation,valeur_fonciere,adresse_numero,adresse_suffixe,adresse_nom_voie,adresse_code_voie,code_postal,code_commune,nom_commune,code_departement,ancien_code_commune,ancien_nom_commune,id_parcelle,ancien_id_parcelle,numero_volume,lot1_numero,lot1_surface_carrez,lot2_numero,lot2_surface_carrez,lot3_numero,lot3_surface_carrez,lot4_numero,lot4_surface_carrez,lot5_numero,lot5_surface_carrez,nombre_lots,code_type_local,type_local,surface_reelle_bati,nombre_pieces_principales,code_nature_culture,nature_culture,code_nature_culture_speciale,nature_culture_speciale,surface_terrain,longitude,latitude
2020-241107,2020-06-23,000001,Vente,95000,2,,RUE DES TILLEULS,0240,21690,21084,Source-Seine,21,,,21084000AB0049,,,,,,,,,,,,,0,1,Maison,150,6,S,sols,,,615,4.685272,47.48828
2020-241107,2020-06-23,000001,Vente,95000,,,LE VILLAGE,B044,21690,21084,Source-Seine,21,,,21084000AB0054,,,,,,,,,,,,,0,,,,,T,terres,,,149,4.684952,47.488064
2020-241107,2020-06-23,000001,Vente,95000,,,LE VILLAGE,B044,21690,21084,Source-Seine,21,,,21084000AB0055,,,,,,,,,,,,,0,,,,,T,terres,,,115,4.685056,47.488057
2020-241107,2020-06-23,000001,Vente,95000,,,LE VILLAGE,B044,21690,21084,Source-Seine,21,,,21084000AB0057,,,,,,,,,,,,,0,,,,,T,terres,,,47,4.685125,47.488191
2020-241107,2020-06-23,000001,Vente,95000,,,LE VILLAGE,B044,21690,21084,Source-Seine,21,,,21084000AB0058,,,,,,,,,,,,,0,,,,,S,sols,,,140,4.685222,47.488187
2020-241107,2020-06-23,000001,Vente,95000,,,LE VILLAGE,B044,21690,21084,Source-Seine,21,,,21084000AB0060,,,,,,,,,,,,,0,,,,,T,terres,,,1133,4.685472,47.488082
2020-241107,2020-06-23,000001,Vente,95000,,,LE VILLAGE,B044,21690,21084,Source-Seine,21,,,21084000AB0109,,,,,,,,,,,,,0,,,,,S,sols,,,67,4.685146,47.488265
2020-241107,2020-06-23,000001,Vente,95000,,,LE VILLAGE,B044,21690,21084,Source-Seine,21,,,21084000AB0136,,,,,,,,,,,,,0,,,,,S,sols,,,90,4.685343,47.48819
2020-244964,2020-09-18,000001,Vente,1000,,,LE VILLAGE NORD,B107,21690,21084,Source-Seine,21,,,21084551AB0069,,,,,,,,,,,,,0,,,,,P,prés,,,2329,4.695855,47.49549
2020-249019,2020-12-11,000001,Vente,25000,,,LA BRUNOTTE,B004,21690,21084,Source-Seine,21,,,210840000C0014,,,,,,,,,,,,,0,,,,,E,eaux,ETANG,Etangs,2480,4.699344,47.466271
2020-249075,2020-12-18,000001,Vente,1500,,,LE VILLAGE NORD,B107,21690,21084,Source-Seine,21,,,21084551AB0048,,,,,,,,,,,,,0,,,,,S,sols,,,151,4.697197,47.494185
2020-249075,2020-12-18,000001,Vente,1500,,,LE VILLAGE NORD,B107,21690,21084,Source-Seine,21,,,21084551AB0049,,,,,,,,,,,,,0,,,,,J,jardins,,,1170,4.696968,47.494093
2020-249075,2020-12-18,000001,Vente,1500,,,LE VILLAGE NORD,B107,21690,21084,Source-Seine,21,,,21084551AB0141,,,,,,,,,,,,,0,,,,,J,jardins,,,238,4.696883,47.494144
2020-249858,2020-12-31,000001,Vente,200,,,SUR PLANCHE,B096,21690,21084,Source-Seine,21,,,21084551AC0026,,,,,,,,,,,,,0,,,,,T,terres,,,1218,4.705729,47.511716
