id_mutation,date_mutation,numero_disposition,nature_mutation,valeur_fonciere,adresse_numero,adresse_suffixe,adresse_nom_voie,adresse_code_voie,code_postal,code_commune,nom_commune,code_departement,ancien_code_commune,ancien_nom_commune,id_parcelle,ancien_id_parcelle,numero_volume,lot1_numero,lot1_surface_carrez,lot2_numero,lot2_surface_carrez,lot3_numero,lot3_surface_carrez,lot4_numero,lot4_surface_carrez,lot5_numero,lot5_surface_carrez,nombre_lots,code_type_local,type_local,surface_reelle_bati,nombre_pieces_principales,code_nature_culture,nature_culture,code_nature_culture_speciale,nature_culture_speciale,surface_terrain,longitude,latitude
2020-238073,2020-02-24,000001,Vente,66000,,,SOUS MONTABON,B174,21210,21139,Champeau-en-Morvan,21,,,211390000H0475,,,,,,,,,,,,,0,,,,,P,prés,,,8768,4.137079,47.258118
2020-238073,2020-02-24,000001,Vente,66000,,,SOUS MONTABON,B174,21210,21139,Champeau-en-Morvan,21,,,211390000H0476,,,,,,,,,,,,,0,,,,,J,jardins,,,354,4.136144,47.257864
2020-238073,2020-02-24,000001,Vente,66000,5033,,SOUS MONTABON,B174,21210,21139,Champeau-en-Morvan,21,,,211390000H0477,,,,,,,,,,,,,0,1,Maison,100,4,S,sols,,,944,4.136117,47.258092
2020-238343,2020-02-29,000001,Vente,260000,,,MONTBROIN,B115,21210,21139,Champeau-en-Morvan,21,,,211390000E0019,,,,,,,,,,,,,0,,,,,P,prés,,,18890,4.179715,47.272326
2020-238343,2020-02-29,000001,Vente,260000,5105,,MONTBROIN,B115,21210,21139,Champeau-en-Morvan,21,,,211390000E0020,,,,,,,,,,,,,0,1,Maison,77,4,S,sols,,,2080,4.180885,47.271978
2020-238343,2020-02-29,000001,Vente,260000,,,MONTBROIN,B115,21210,21139,Champeau-en-Morvan,21,,,211390000E0021,,,,,,,,,,,,,0,,,,,J,jardins,,,620,4.181114,47.271731
2020-238819,2020-03-27,000001,Vente,23000,,,GUIJON,B097,21210,21139,Champeau-en-Morvan,21,,,211390000G0211,,,,,,,,,,,,,0,,,,,BR,futaies résineuses,,,2460,4.18466,47.249159
2020-238819,2020-03-27,000001,Vente,23000,,,ES GARENNES,B062,21210,21139,Champeau-en-Morvan,21,,,211390000G0425,,,,,,,,,,,,,0,,,,,BR,futaies résineuses,,,21856,4.182252,47.249363
2020-238819,2020-03-27,000001,Vente,23000,,,GUIJON,B097,21210,21139,Champeau-en-Morvan,21,,,211390000G0431,,,,,,,,,,,,,0,,,,,BR,futaies résineuses,,,7060,4.186024,47.249199
2020-238819,2020-03-27,000001,Vente,23000,,,GUIJON,B097,21210,21139,Champeau-en-Morvan,21,,,211390000G0433,,,,,,,,,,,,,0,,,,,BR,futaies résineuses,,,4520,4.184669,47.24933
2020-238819,2020-03-27,000001,Vente,23000,,,ES GARENNES,B062,21210,21139,Champeau-en-Morvan,21,,,211390000G0435,,,,,,,,,,,,,0,,,,,E,eaux,ETANG,Etangs,32047,4.182128,47.250884
2020-239335,2020-03-12,000001,Vente,1647,,,ES FOSSE,B061,21210,21139,Champeau-en-Morvan,21,,,211390000G0302,,,,,,,,,,,,,0,,,,,BS,taillis sous futaie,,,3980,4.165588,47.251118
2020-239335,2020-03-12,000001,Vente,1647,,,ES FOSSE,B061,21210,21139,Champeau-en-Morvan,21,,,211390000G0305,,,,,,,,,,,,,0,,,,,BS,taillis sous futaie,,,5210,4.166016,47.249851
2020-239335,2020-03-12,000001,Vente,1647,,,ES FOSSE,B061,21210,21139,Champeau-en-Morvan,21,,,211390000G0313,,,,,,,,,,,,,0,,,,,BS,taillis sous futaie,,,11037,4.164547,47.251279
2020-239419,2020-04-24,000001,Vente,75000,,,LES CLOISIAUX,B044,21210,21139,Champeau-en-Morvan,21,,,211390000H0073,,,,,,,,,,,,,0,,,,,BT,taillis simples,,,10714,4.161338,47.263727
2020-239419,2020-04-24,000001,Vente,75000,,,LES CLOISIAUX,B044,21210,21139,Champeau-en-Morvan,21,,,211390000H0074,,,,,,,,,,,,,0,,,,,BR,futaies résineuses,,,3704,4.161566,47.263121
2020-239419,2020-04-24,000001,Vente,75000,,,LES CLOISIAUX,B044,21210,21139,Champeau-en-Morvan,21,,,211390000H0075,,,,,,,,,,,,,0,,,,,BR,futaies résineuses,,,22264,4.163644,47.263441
2020-239419,2020-04-24,000001,Vente,75000,,,LES CLOISIAUX,B044,21210,21139,Champeau-en-Morvan,21,,,211390000H0076,,,,,,,,,,,,,0,,,,,BS,taillis sous futaie,,,28876,4.161851,47.262014
2020-239419,2020-04-24,000001,Vente,75000,,,LES CLOISIAUX,B044,21210,21139,Champeau-en-Morvan,21,,,211390000H0077,,,,,,,,,,,,,0,,,,,BR,futaies résineuses,,,26804,4.164232,47.261605
2020-239419,2020-04-24,000001,Vente,75000,,,LA PORROUDE,B140,21210,21139,Champeau-en-Morvan,21,,,211390000H0086,,,,,,,,,,,,,0,,,,,P,prés,,,2240,4.160091,47.262212
2020-239419,2020-04-24,000001,Vente,75000,,,LA PORROUDE,B140,21210,21139,Champeau-en-Morvan,21,,,211390000H0091,,,,,,,,,,,,,0,,,,,P,prés,,,740,4.159169,47.262057
2020-243526,2020-08-14,000001,Vente,1110,,,SUR BOIS GAUCHAS,B009,21210,21139,Champeau-en-Morvan,21,,,211390000L0098,,,,,,,,,,,,,0,,,,,BR,futaies résineuses,,,1876,4.120679,47.28863
2020-243526,2020-08-14,000001,Vente,1110,,,SUR BOIS GAUCHAS,B009,21210,21139,Champeau-en-Morvan,21,,,211390000L0099,,,,,,,,,,,,,0,,,,,BR,futaies résineuses,,,2555,4.120979,47.288686
2020-243526,2020-08-14,000001,Vente,1110,,,SUR BOIS GAUCHAS,B009,21210,21139,Champeau-en-Morvan,21,,,211390000L0143,,,,,,,,,,,,,0,,,,,BR,futaies résineuses,,,1700,4.120533,47.289486
2020-245119,2020-09-14,000002,Vente,125,,,PRAIRIE DE CHAMPEAU,B142,21210,21139,Champeau-en-Morvan,21,,,211390000L0745,,,,,,,,,,,,,0,,,,,P,prés,,,170,4.135331,47.278128
2020-246143,2020-10-14,000001,Vente,17266,,,PATURE MARNEE,B126,21210,21139,Champeau-en-Morvan,21,,,211390000C0065,,,,,,,,,,,,,0,,,,,P,prés,,,23351,4.183279,47.283913
2020-246143,2020-10-14,000001,Vente,17266,,,PATURE MARNEE,B126,21210,21139,Champeau-en-Morvan,21,,,211390000C0066,,,,,,,,,,,,,0,,,,,P,prés,,,10811,4.183964,47.285378
2020-246143,2020-10-14,000001,Vente,17266,,,PATURE MARNEE,B126,21210,21139,Champeau-en-Morvan,21,,,211390000C0078,,,,,,,,,,,,,0,,,,,P,prés,,,4639,4.18171,47.284215
2020-246143,2020-10-14,000001,Vente,17266,,,LE MAILLOT,B102,21210,21139,Champeau-en-Morvan,21,,,211390000C0079,,,,,,,,,,,,,0,,,,,P,prés,,,13167,4.181533,47.283327
2020-246143,2020-10-14,000001,Vente,17266,,,LE MAILLOT,B102,21210,21139,Champeau-en-Morvan,21,,,211390000C0080,,,,,,,,,,,,,0,,,,,P,prés,,,9747,4.181964,47.282371
2020-246143,2020-10-14,000001,Vente,17266,,,LE MAILLOT,B102,21210,21139,Champeau-en-Morvan,21,,,211390000C0082,,,,,,,,,,,,,0,,,,,T,terres,,,370,4.180997,47.282829
2020-246143,2020-10-14,000001,Vente,17266,,,LE MAILLOT,B102,21210,21139,Champeau-en-Morvan,21,,,211390000C0088,,,,,,,,,,,,,0,,,,,P,prés,,,11595,4.180175,47.282921
2020-246143,2020-10-14,000001,Vente,17266,,,LES MELONGES,B107,21210,21139,Champeau-en-Morvan,21,,,211390000C0089,,,,,,,,,,,,,0,,,,,P,prés,,,11316,4.179883,47.284325
2020-246143,2020-10-14,000001,Vente,17266,,,LE MAILLOT,B102,21210,21139,Champeau-en-Morvan,21,,,211390000C0130,,,,,,,,,,,,,0,,,,,S,sols,,,446,4.181021,47.282688
2020-246143,2020-10-14,000001,Vente,17266,,,LE MAILLOT,B102,21210,21139,Champeau-en-Morvan,21,,,211390000C0133,,,,,,,,,,,,,0,,,,,S,sols,,,92,4.181045,47.282595
2020-246143,2020-10-14,000001,Vente,17266,,,CROS DE LARDEILLES,B053,21210,21139,Champeau-en-Morvan,21,,,211390000D0062,,,,,,,,,,,,,0,,,,,T,terres,,,8050,4.177089,47.282402
2020-246143,2020-10-14,000001,Vente,17266,,,LES CARONS,B019,21210,21139,Champeau-en-Morvan,21,,,211390000D0064,,,,,,,,,,,,,0,,,,,P,prés,,,10420,4.177252,47.280656
2020-246143,2020-10-14,000001,Vente,17266,,,TEUREAU DE MONTABON,B178,21210,21139,Champeau-en-Morvan,21,,,211390000K0193,,,,,,,,,,,,,0,,,,,BR,futaies résineuses,,,4420,4.129133,47.261944
2020-246143,2020-10-14,000001,Vente,17266,,,PATURES CHAMPEAU,B128,21210,21139,Champeau-en-Morvan,21,,,211390000L0611,,,,,,,,,,,,,0,,,,,P,prés,,,9260,4.147809,47.276294
2020-246313,2020-10-20,000001,Vente,10000,,,LE MAILLOT,B102,21210,21139,Champeau-en-Morvan,21,,,211390000C0083,,,,,,,,,,,,,0,,,,,J,jardins,,,589,4.180593,47.282532
2020-246313,2020-10-20,000001,Vente,10000,,,LE MAILLOT,B102,21210,21139,Champeau-en-Morvan,21,,,211390000C0131,,,,,,,,,,,,,0,,,,,VE,vergers,,,22,4.180859,47.282624
2020-246313,2020-10-20,000001,Vente,10000,,,LE MAILLOT,B102,21210,21139,Champeau-en-Morvan,21,,,211390000C0132,,,,,,,,,,,,,0,,,,,S,sols,,,1716,4.180994,47.282283
2020-247306,2020-11-19,000001,Vente,300,,,LA CUREE,B054,21210,21139,Champeau-en-Morvan,21,,,211390000L0689,,,,,,,,,,,,,0,,,,,BR,futaies résineuses,,,1575,4.132549,47.278911
2020-247306,2020-11-19,000001,Vente,300,,,LA CUREE,B054,21210,21139,Champeau-en-Morvan,21,,,211390000L0692,,,,,,,,,,,,,0,,,,,BR,futaies résineuses,,,556,4.132929,47.279249
2020-247801,2020-11-16,000001,Vente,93000,5132,,SAINT LEGER,B170,21210,21139,Champeau-en-Morvan,21,,,211390000F0041,,,,,,,,,,,,,0,1,Maison,67,3,S,sols,,,2000,4.182021,47.260396
2020-247801,2020-11-16,000001,Vente,93000,,,SAINT LEGER,B170,21210,21139,Champeau-en-Morvan,21,,,211390000F0042,,,,,,,,,,,,,0,,,,,P,prés,,,4000,4.182254,47.260827
2020-247801,2020-11-16,000001,Vente,93000,,,SAINT LEGER,B170,21210,21139,Champeau-en-Morvan,21,,,211390000F0043,,,,,,,,,,,,,0,,,,,P,prés,,,470,4.181974,47.261161
2020-247801,2020-11-16,000001,Vente,93000,,,SAINT LEGER,B170,21210,21139,Champeau-en-Morvan,21,,,211390000F0044,,,,,,,,,,,,,0,,,,,P,prés,,,2500,4.181539,47.26132
2020-247801,2020-11-16,000001,Vente,93000,,,SAINT LEGER,B170,21210,21139,Champeau-en-Morvan,21,,,211390000F0296,,,,,,,,,,,,,0,,,,,S,sols,,,399,4.181897,47.260686
2020-247965,2020-11-12,000001,Vente,120000,,,PRES BORDOT,B156,21210,21139,Champeau-en-Morvan,21,,,211390000F0054,,,,,,,,,,,,,0,,,,,P,prés,,,5607,4.185831,47.264596
2020-247965,2020-11-12,000001,Vente,120000,5108,,PRES BORDOT,B156,21210,21139,Champeau-en-Morvan,21,,,211390000F0055,,,,,,,,,,,,,0,1,Maison,24,1,S,sols,,,203,4.185576,47.265045
2020-247965,2020-11-12,000001,Vente,120000,,,PRES BORDOT,B156,21210,21139,Champeau-en-Morvan,21,,,211390000F0056,,,,,,,,,,,,,0,,,,,P,prés,,,7985,4.184736,47.264789
2020-247965,2020-11-12,000001,Vente,120000,,,PRES BORDOT,B156,21210,21139,Champeau-en-Morvan,21,,,211390000F0057,,,,,,,,,,,,,0,,,,,P,prés,,,5552,4.184003,47.265162
2020-247965,2020-11-12,000001,Vente,120000,,,ETANG BORDOT,B066,21210,21139,Champeau-en-Morvan,21,,,211390000F0098,,,,,,,,,,,,,0,,,,,E,eaux,LAC,Lac,122760,4.190573,47.266497
2020-247965,2020-11-12,000001,Vente,120000,,,PIERRES FOULTERRES,B132,21210,21139,Champeau-en-Morvan,21,,,211390000F0224,,,,,,,,,,,,,0,,,,,BS,taillis sous futaie,,,4509,4.190888,47.264359
2020-247965,2020-11-12,000001,Vente,120000,,,PIERRES FOULTERRES,B132,21210,21139,Champeau-en-Morvan,21,,,211390000F0225,,,,,,,,,,,,,0,,,,,T,terres,,,8861,4.191041,47.264773
2020-247965,2020-11-12,000001,Vente,120000,,,PIERRES FOULTERRES,B132,21210,21139,Champeau-en-Morvan,21,,,211390000F0226,,,,,,,,,,,,,0,,,,,BR,futaies résineuses,,,4927,4.190845,47.265261
2020-247965,2020-11-12,000001,Vente,120000,,,PIERRES FOULTERRES,B132,21210,21139,Champeau-en-Morvan,21,,,211390000F0227,,,,,,,,,,,,,0,,,,,L,landes,,,1222,4.190814,47.265552
2020-247965,2020-11-12,000001,Vente,120000,,,PIERRES FOULTERRES,B132,21210,21139,Champeau-en-Morvan,21,,,211390000F0228,,,,,,,,,,,,,0,,,,,P,prés,,,2917,4.191579,47.265985
2020-247965,2020-11-12,000001,Vente,120000,,,PIERRES FOULTERRES,B132,21210,21139,Champeau-en-Morvan,21,,,211390000F0229,,,,,,,,,,,,,0,,,,,BR,futaies résineuses,,,3034,4.19053,47.265751
2020-247965,2020-11-12,000001,Vente,120000,,,PIERRES FOULTERRES,B132,21210,21139,Champeau-en-Morvan,21,,,211390000F0230,,,,,,,,,,,,,0,,,,,BR,futaies résineuses,,,12130,4.189342,47.26498
2020-247965,2020-11-12,000001,Vente,120000,,,PIERRES FOULTERRES,B132,21210,21139,Champeau-en-Morvan,21,,,211390000F0231,,,,,,,,,,,,,0,,,,,P,prés,,,8720,4.188337,47.26432
2020-247965,2020-11-12,000001,Vente,120000,,,PIERRES FOULTERRES,B132,21210,21139,Champeau-en-Morvan,21,,,211390000F0233,,,,,,,,,,,,,0,,,,,L,landes,,,4060,4.187691,47.264806
2020-247965,2020-11-12,000001,Vente,120000,,,PIERRES FOULTERRES,B132,21210,21139,Champeau-en-Morvan,21,,,211390000F0234,,,,,,,,,,,,,0,,,,,L,landes,,,311,4.187098,47.264405
2020-247965,2020-11-12,000001,Vente,120000,,,PIERRES FOULTERRES,B132,21210,21139,Champeau-en-Morvan,21,,,211390000F0240,,,,,,,,,,,,,0,,,,,L,landes,,,152,4.187168,47.264276
2020-247966,2020-11-12,000001,Vente,25333.33,,,PRES BORDOT,B156,21210,21139,Champeau-en-Morvan,21,,,211390000F0057,,,,,,,,,,,,,0,,,,,P,prés,,,5552,4.184003,47.265162
2020-247966,2020-11-12,000001,Vente,25333.33,,,PIERRES FOULTERRES,B132,21210,21139,Champeau-en-Morvan,21,,,211390000F0224,,,,,,,,,,,,,0,,,,,BS,taillis sous futaie,,,4509,4.190888,47.264359
2020-247966,2020-11-12,000001,Vente,25333.33,,,PIERRES FOULTERRES,B132,21210,21139,Champeau-en-Morvan,21,,,211390000F0225,,,,,,,,,,,,,0,,,,,T,terres,,,8861,4.191041,47.264773
2020-247966,2020-11-12,000001,Vente,25333.33,,,PIERRES FOULTERRES,B132,21210,21139,Champeau-en-Morvan,21,,,211390000F0226,,,,,,,,,,,,,0,,,,,BR,futaies résineuses,,,4927,4.190845,47.265261
2020-247966,2020-11-12,000001,Vente,25333.33,,,PIERRES FOULTERRES,B132,21210,21139,Champeau-en-Morvan,21,,,211390000F0227,,,,,,,,,,,,,0,,,,,L,landes,,,1222,4.190814,47.265552
2020-247966,2020-11-12,000001,Vente,25333.33,,,PIERRES FOULTERRES,B132,21210,21139,Champeau-en-Morvan,21,,,211390000F0228,,,,,,,,,,,,,0,,,,,P,prés,,,2917,4.191579,47.265985
2020-247966,2020-11-12,000001,Vente,25333.33,,,PIERRES FOULTERRES,B132,21210,21139,Champeau-en-Morvan,21,,,211390000F0229,,,,,,,,,,,,,0,,,,,BR,futaies résineuses,,,3034,4.19053,47.265751
2020-247966,2020-11-12,000001,Vente,25333.33,,,PIERRES FOULTERRES,B132,21210,21139,Champeau-en-Morvan,21,,,211390000F0230,,,,,,,,,,,,,0,,,,,BR,futaies résineuses,,,12130,4.189342,47.26498
2020-247966,2020-11-12,000001,Vente,25333.33,,,PIERRES FOULTERRES,B132,21210,21139,Champeau-en-Morvan,21,,,211390000F0231,,,,,,,,,,,,,0,,,,,P,prés,,,8720,4.188337,47.26432
2020-247966,2020-11-12,000001,Vente,25333.33,,,PIERRES FOULTERRES,B132,21210,21139,Champeau-en-Morvan,21,,,211390000F0233,,,,,,,,,,,,,0,,,,,L,landes,,,4060,4.187691,47.264806
2020-247966,2020-11-12,000001,Vente,25333.33,,,PIERRES FOULTERRES,B132,21210,21139,Champeau-en-Morvan,21,,,211390000F0234,,,,,,,,,,,,,0,,,,,L,landes,,,311,4.187098,47.264405
2020-247966,2020-11-12,000001,Vente,25333.33,,,PIERRES FOULTERRES,B132,21210,21139,Champeau-en-Morvan,21,,,211390000F0240,,,,,,,,,,,,,0,,,,,L,landes,,,152,4.187168,47.264276
2020-248442,2020-12-11,000001,Vente,58000,,,CHAMPEAU,B031,21210,21139,Champeau-en-Morvan,21,,,21139000AC0045,,,,,,,,,,,,,0,,,,,S,sols,,,700,4.143509,47.2756
2020-248442,2020-12-11,000001,Vente,58000,5056,C,ETANG DE CHAMPEAU,B067,21210,21139,Champeau-en-Morvan,21,,,211390000I0264,,,,,,,,,,,,,0,3,Dépendance,,0,E,eaux,LAC,Lac,292214,4.147616,47.272065
2020-248442,2020-12-11,000001,Vente,58000,5056,C,ETANG DE CHAMPEAU,B067,21210,21139,Champeau-en-Morvan,21,,,211390000I0264,,,,,,,,,,,,,0,3,Dépendance,,0,S,sols,,,248,4.147616,47.272065
2020-249436,2020-12-30,000001,Vente,2000,,,ETEULE PACOT,B070,21210,21139,Champeau-en-Morvan,21,,,211390000G0354,,,,,,,,,,,,,0,,,,,BR,futaies résineuses,,,1500,4.164247,47.255103
2020-249436,2020-12-30,000001,Vente,2000,,,ETEULE PACOT,B070,21210,21139,Champeau-en-Morvan,21,,,211390000G0355,,,,,,,,,,,,,0,,,,,BR,futaies résineuses,,,5650,4.164345,47.255859
2020-249612,2020-12-23,000001,Vente,69000,,,ESCHAMPS,B065,21210,21139,Champeau-en-Morvan,21,,,21139000AB0006,,,,,,,,,,,,,0,,,,,J,jardins,,,225,4.139075,47.288944
2020-249612,2020-12-23,000001,Vente,69000,5172,,ESCHAMPS,B065,21210,21139,Champeau-en-Morvan,21,,,21139000AB0007,,,,,,,,,,,,,0,3,Dépendance,,0,S,sols,,,265,4.13915,47.288812
2020-249612,2020-12-23,000001,Vente,69000,5172,,ESCHAMPS,B065,21210,21139,Champeau-en-Morvan,21,,,21139000AB0007,,,,,,,,,,,,,0,3,Dépendance,,0,S,sols,,,265,4.13915,47.288812
2020-249612,2020-12-23,000001,Vente,69000,5172,,ESCHAMPS,B065,21210,21139,Champeau-en-Morvan,21,,,21139000AB0007,,,,,,,,,,,,,0,3,Dépendance,,0,S,sols,,,265,4.13915,47.288812
2020-249612,2020-12-23,000001,Vente,69000,5172,,ESCHAMPS,B065,21210,21139,Champeau-en-Morvan,21,,,21139000AB0007,,,,,,,,,,,,,0,3,Dépendance,,0,S,sols,,,265,4.13915,47.288812
2020-249612,2020-12-23,000001,Vente,69000,5171,,ESCHAMPS,B065,21210,21139,Champeau-en-Morvan,21,,,21139000AB0008,,,,,,,,,,,,,0,1,Maison,84,3,S,sols,,,387,4.139015,47.288601
2020-249612,2020-12-23,000001,Vente,69000,5171,,ESCHAMPS,B065,21210,21139,Champeau-en-Morvan,21,,,21139000AB0008,,,,,,,,,,,,,0,3,Dépendance,,0,S,sols,,,387,4.139015,47.288601
2020-249612,2020-12-23,000001,Vente,69000,,,ESCHAMPS,B065,21210,21139,Champeau-en-Morvan,21,,,21139000AB0011,,,,,,,,,,,,,0,,,,,J,jardins,,,278,4.139178,47.28847
2020-249612,2020-12-23,000001,Vente,69000,,,ESCHAMPS,B065,21210,21139,Champeau-en-Morvan,21,,,21139000AB0012,,,,,,,,,,,,,0,,,,,T,terres,,,64,4.139287,47.288553
2020-249612,2020-12-23,000001,Vente,69000,,,ESCHAMPS,B065,21210,21139,Champeau-en-Morvan,21,,,21139000AB0065,,,,,,,,,,,,,0,,,,,S,sols,,,7,4.139172,47.288628
