id_mutation,date_mutation,numero_disposition,nature_mutation,valeur_fonciere,adresse_numero,adresse_suffixe,adresse_nom_voie,adresse_code_voie,code_postal,code_commune,nom_commune,code_departement,ancien_code_commune,ancien_nom_commune,id_parcelle,ancien_id_parcelle,numero_volume,lot1_numero,lot1_surface_carrez,lot2_numero,lot2_surface_carrez,lot3_numero,lot3_surface_carrez,lot4_numero,lot4_surface_carrez,lot5_numero,lot5_surface_carrez,nombre_lots,code_type_local,type_local,surface_reelle_bati,nombre_pieces_principales,code_nature_culture,nature_culture,code_nature_culture_speciale,nature_culture_speciale,surface_terrain,longitude,latitude
2020-239852,2020-05-29,000001,Vente,30000,5029,,PLAINE DE CHARMERONDE,B073,21440,21142,Chanceaux,21,,,21142000ZM0015,,,,,,,,,,,,,0,3,Dépendance,,0,S,sols,,,2269,4.736884,47.520609
2020-239852,2020-05-29,000001,Vente,30000,5029,,PLAINE DE CHARMERONDE,B073,21440,21142,Chanceaux,21,,,21142000ZM0015,,,,,,,,,,,,,0,3,Dépendance,,0,P,prés,,,2631,4.736884,47.520609
2020-239852,2020-05-29,000001,Vente,30000,5029,,PLAINE DE CHARMERONDE,B073,21440,21142,Chanceaux,21,,,21142000ZM0015,,,,,,,,,,,,,0,3,Dépendance,,0,P,prés,,,5262,4.736884,47.520609
2020-245014,2020-09-19,000001,Vente,1216,,,LE CHENE SEC,B027,21440,21142,Chanceaux,21,,,21142000ZO0029,,,,,,,,,,,,,0,,,,,P,prés,,,208,4.735011,47.516231
2020-245014,2020-09-19,000001,Vente,1216,,,LE CHENE SEC,B027,21440,21142,Chanceaux,21,,,21142000ZO0030,,,,,,,,,,,,,0,,,,,P,prés,,,400,4.733805,47.515972
2020-245893,2020-10-15,000001,Vente,86000,44,,GR GRANDE RUE,0130,21440,21142,Chanceaux,21,,,211420000E0052,,,,,,,,,,,,,0,3,Dépendance,,0,S,sols,,,220,4.717219,47.520651
2020-245893,2020-10-15,000001,Vente,86000,44,,GR GRANDE RUE,0130,21440,21142,Chanceaux,21,,,211420000E0052,,,,,,,,,,,,,0,3,Dépendance,,0,S,sols,,,220,4.717219,47.520651
2020-245893,2020-10-15,000001,Vente,86000,44,,GR GRANDE RUE,0130,21440,21142,Chanceaux,21,,,211420000E0052,,,,,,,,,,,,,0,1,Maison,269,7,S,sols,,,220,4.717219,47.520651
2020-245893,2020-10-15,000001,Vente,86000,,,LE VILLAGE,B094,21440,21142,Chanceaux,21,,,211420000E0053,,,,,,,,,,,,,0,,,,,S,sols,,,90,4.717213,47.520599
