id_mutation,date_mutation,numero_disposition,nature_mutation,valeur_fonciere,adresse_numero,adresse_suffixe,adresse_nom_voie,adresse_code_voie,code_postal,code_commune,nom_commune,code_departement,ancien_code_commune,ancien_nom_commune,id_parcelle,ancien_id_parcelle,numero_volume,lot1_numero,lot1_surface_carrez,lot2_numero,lot2_surface_carrez,lot3_numero,lot3_surface_carrez,lot4_numero,lot4_surface_carrez,lot5_numero,lot5_surface_carrez,nombre_lots,code_type_local,type_local,surface_reelle_bati,nombre_pieces_principales,code_nature_culture,nature_culture,code_nature_culture_speciale,nature_culture_speciale,surface_terrain,longitude,latitude
2020-243051,2020-07-31,000001,Vente,2500,,,PRES DE LA FONTAINE,B056,21330,21143,Channay,21,,,21143000ZD0027,,,,,,,,,,,,,0,,,,,T,terres,,,3010,4.35723,47.894677
2020-244952,2020-09-15,000001,Vente,4104.3,,,LE VAL AUX DAIMS,B064,21330,21143,Channay,21,,,211430000B0069,,,,,,,,,,,,,0,,,,,BR,futaies résineuses,,,13800,4.340846,47.895484
2020-244952,2020-09-15,000001,Vente,4104.3,,,LE VAL AUX DAIMS,B064,21330,21143,Channay,21,,,211430000B0073,,,,,,,,,,,,,0,,,,,BR,futaies résineuses,,,7275,4.342911,47.897502
2020-244952,2020-09-15,000001,Vente,4104.3,,,AU CHEMIN DE MOLESMES,B029,21330,21143,Channay,21,,,211430000B0078,,,,,,,,,,,,,0,,,,,BR,futaies résineuses,,,15990,4.338728,47.895134
2020-244952,2020-09-15,000001,Vente,4104.3,,,LA COTE AUX JUIFS,B040,21330,21143,Channay,21,,,211430000B0106,,,,,,,,,,,,,0,,,,,BR,futaies résineuses,,,3978,4.34902,47.900288
2020-244957,2020-09-09,000001,Vente,750,,,LES ROCHEREUILS,B057,21330,21143,Channay,21,,,21143000WB0198,,,,,,,,,,,,,0,,,,,BR,futaies résineuses,,,3630,4.335053,47.894448
2020-248391,2020-11-27,000001,Vente,12000,,,VILLIERS LES MOINES,B075,21330,21143,Channay,21,,,21143000AC0026,,,,,,,,,,,,,0,,,,,P,prés,,,2366,,
2020-248391,2020-11-27,000001,Vente,12000,,,VILLIERS LES MOINES,B075,21330,21143,Channay,21,,,21143000AC0028,,,,,,,,,,,,,0,,,,,S,sols,,,774,4.356856,47.893597
2020-248882,2020-07-31,000001,Vente,7138,,,CHAMPS ROSE,B023,21330,21143,Channay,21,,,21143000WA0004,,,,,,,,,,,,,0,,,,,T,terres,,,13640,4.308963,47.898111
