id_mutation,date_mutation,numero_disposition,nature_mutation,valeur_fonciere,adresse_numero,adresse_suffixe,adresse_nom_voie,adresse_code_voie,code_postal,code_commune,nom_commune,code_departement,ancien_code_commune,ancien_nom_commune,id_parcelle,ancien_id_parcelle,numero_volume,lot1_numero,lot1_surface_carrez,lot2_numero,lot2_surface_carrez,lot3_numero,lot3_surface_carrez,lot4_numero,lot4_surface_carrez,lot5_numero,lot5_surface_carrez,nombre_lots,code_type_local,type_local,surface_reelle_bati,nombre_pieces_principales,code_nature_culture,nature_culture,code_nature_culture_speciale,nature_culture_speciale,surface_terrain,longitude,latitude
2020-240568,2020-05-27,000001,Vente,3000,,,LE VILLAGE,B088,21350,21147,Charny,21,,,21147000AB0160,,,,,,,,,,,,,0,,,,,S,sols,,,238,4.4292,47.336869
2020-241453,2020-07-07,000001,Vente,130680,,,BASSE COUR DU CHATEAU,B002,21350,21147,Charny,21,,,21147000AB0012,,,,,,,,,,,,,0,,,,,T,terres,,,11455,4.426673,47.33757
2020-241453,2020-07-07,000001,Vente,130680,3,,RUE DU CHATEAU,0020,21350,21147,Charny,21,,,21147000AB0138,,,,,,,,,,,,,0,1,Maison,76,3,S,sols,,,880,4.427524,47.337176
2020-241453,2020-07-07,000001,Vente,130680,,,LE VILLAGE,B088,21350,21147,Charny,21,,,21147000AB0149,,,,,,,,,,,,,0,,,,,J,jardins,,,92,4.427999,47.33715
2020-241453,2020-07-07,000001,Vente,130680,,,LE VILLAGE,B088,21350,21147,Charny,21,,,21147000AB0217,,,,,,,,,,,,,0,,,,,S,sols,,,31,4.427436,47.337081
2020-243515,2020-08-26,000001,Vente,262520,,,LE VILLAGE,B088,21350,21147,Charny,21,,,21147000AB0088,,,,,,,,,,,,,0,,,,,J,jardins,,,389,4.42911,47.334942
2020-243515,2020-08-26,000001,Vente,262520,5039,,RUE DES JUIFS,0050,21350,21147,Charny,21,,,21147000AB0218,,,,,,,,,,,,,0,3,Dépendance,,0,S,sols,,,442,4.428776,47.335139
2020-243515,2020-08-26,000001,Vente,262520,2,,RUE DES JUIFS,0050,21350,21147,Charny,21,,,21147000AB0219,,,,,,,,,,,,,0,1,Maison,101,4,S,sols,,,1218,4.429126,47.335147
2020-243515,2020-08-26,000001,Vente,262520,,,SUR LE CHATELET,B020,21350,21147,Charny,21,,,21147000AB0220,,,,,,,,,,,,,0,,,,,P,prés,,,314,4.429551,47.335152
2020-243515,2020-08-26,000001,Vente,262520,,,LE VILLAGE,B088,21350,21147,Charny,21,,,21147000AB0222,,,,,,,,,,,,,0,,,,,P,prés,,,21,4.429138,47.335227
2020-246686,2020-10-16,000001,Vente,337200,,,LES FOSSES,B040,21350,21147,Charny,21,,,21147000AB0011,,,,,,,,,,,,,0,,,,,L,landes,,,115,4.427025,47.337136
2020-246686,2020-10-16,000001,Vente,337200,1,,RUE SAINT ANTOINE,0070,21350,21147,Charny,21,,,21147000AB0136,,,,,,,,,,,,,0,3,Dépendance,,0,S,sols,,,1075,4.427142,47.336918
2020-246686,2020-10-16,000001,Vente,337200,1,,RUE SAINT ANTOINE,0070,21350,21147,Charny,21,,,21147000AB0136,,,,,,,,,,,,,0,3,Dépendance,,0,S,sols,,,1075,4.427142,47.336918
2020-246686,2020-10-16,000001,Vente,337200,1,,RUE SAINT ANTOINE,0070,21350,21147,Charny,21,,,21147000AB0136,,,,,,,,,,,,,0,1,Maison,192,6,S,sols,,,1075,4.427142,47.336918
2020-246686,2020-10-16,000001,Vente,337200,,,LES FOSSES,B040,21350,21147,Charny,21,,,21147000AB0215,,,,,,,,,,,,,0,,,,,L,landes,,,656,4.426877,47.33708
2020-246686,2020-10-16,000001,Vente,337200,5023,,LE VILLAGE,B088,21350,21147,Charny,21,,,21147000AB0216,,,,,,,,,,,,,0,3,Dépendance,,0,S,sols,,,369,4.427337,47.337066
