id_mutation,date_mutation,numero_disposition,nature_mutation,valeur_fonciere,adresse_numero,adresse_suffixe,adresse_nom_voie,adresse_code_voie,code_postal,code_commune,nom_commune,code_departement,ancien_code_commune,ancien_nom_commune,id_parcelle,ancien_id_parcelle,numero_volume,lot1_numero,lot1_surface_carrez,lot2_numero,lot2_surface_carrez,lot3_numero,lot3_surface_carrez,lot4_numero,lot4_surface_carrez,lot5_numero,lot5_surface_carrez,nombre_lots,code_type_local,type_local,surface_reelle_bati,nombre_pieces_principales,code_nature_culture,nature_culture,code_nature_culture_speciale,nature_culture_speciale,surface_terrain,longitude,latitude
2020-237652,2020-02-13,000001,Vente,346750,9,,RUE DU MOULIN,0049,21490,21179,Clénay,21,,,21179000ZD0276,,,,,,,,,,,,,0,1,Maison,120,6,S,sols,,,825,5.114971,47.404565
2020-238575,2020-03-11,000001,Vente,336500,7,,IMP DES ECUREUILS,0020,21490,21179,Clénay,21,,,21179000ZC0315,,,,,,,,,,,,,0,1,Maison,143,5,AB,terrains a bâtir,,,544,5.124515,47.407451
2020-238684,2020-03-17,000001,Vente,362000,4,,IMP DES ECUREUILS,0020,21490,21179,Clénay,21,,,21179000ZC0314,,,,,,,,,,,,,0,1,Maison,138,5,S,sols,,,240,5.125151,47.407105
2020-238684,2020-03-17,000001,Vente,362000,,,LA FOURREE,B029,21490,21179,Clénay,21,,,21179000ZC0322,,,,,,,,,,,,,0,,,,,AB,terrains a bâtir,,,362,5.125145,47.406997
2020-239984,2020-06-03,000002,Vente,3000,3,,RUE DES DIMES,0018,21490,21179,Clénay,21,,,211790000D0455,,,,,,,,,,,,,0,,,,,S,sols,,,31,5.120528,47.404045
2020-240157,2020-05-27,000001,Vente,395337,11,,RTE DE BRETIGNY,0007,21490,21179,Clénay,21,,,21179000ZD0239,,,,,,,,,,,,,0,1,Maison,127,5,S,sols,,,800,5.113236,47.402069
2020-240157,2020-05-27,000001,Vente,395337,11,,RTE DE BRETIGNY,0007,21490,21179,Clénay,21,,,21179000ZD0239,,,,,,,,,,,,,0,1,Maison,127,5,P,prés,,,1268,5.113236,47.402069
2020-240157,2020-05-27,000001,Vente,395337,,,LES GRANDES VARENNES,B031,21490,21179,Clénay,21,,,21179000ZD0243,,,,,,,,,,,,,0,,,,,P,prés,,,317,5.113865,47.401795
2020-240157,2020-05-27,000001,Vente,395337,,,LES GRANDES VARENNES,B031,21490,21179,Clénay,21,,,21179000ZD0245,,,,,,,,,,,,,0,,,,,P,prés,,,270,5.11367,47.401845
2020-240193,2020-05-25,000001,Vente,180000,,,AUX LOUVIERES,B036,21490,21179,Clénay,21,,,21179000ZC0065,,,,,,,,,,,,,0,,,,,S,sols,,,7,5.124142,47.406975
2020-240193,2020-05-25,000001,Vente,180000,2,,RUE DES LOUVIERES,0039,21490,21179,Clénay,21,,,21179000ZC0066,,,,,,,,,,,,,0,1,Maison,86,4,S,sols,,,677,5.124001,47.406854
2020-240193,2020-05-25,000001,Vente,180000,,,AUX LOUVIERES,B036,21490,21179,Clénay,21,,,21179000ZC0099,,,,,,,,,,,,,0,,,,,S,sols,,,8,5.124149,47.406894
2020-240206,2020-06-05,000001,Vente,45000,1,,IMP CLAUDE MONET,0012,21490,21179,Clénay,21,,,21179000ZC0250,,,,,,,,,,,,,0,1,Maison,138,4,S,sols,,,811,5.124154,47.405831
2020-240878,2020-06-08,000001,Vente,235000,72,,GR GRANDE RUE,0032,21490,21179,Clénay,21,,,211790000D0394,,,,,,,,,,,,,0,1,Maison,104,6,S,sols,,,500,5.116901,47.403686
2020-240878,2020-06-08,000001,Vente,235000,72,,GR GRANDE RUE,0032,21490,21179,Clénay,21,,,211790000D0394,,,,,,,,,,,,,0,1,Maison,104,6,J,jardins,,,532,5.116901,47.403686
2020-241316,2020-06-17,000001,Vente,362000,12,,RUE DE LA FONTAINE AUX LIONS,0028,21490,21179,Clénay,21,,,21179000ZC0119,,,,,,,,,,,,,0,1,Maison,142,5,S,sols,,,1623,5.118832,47.409771
2020-241877,2020-07-07,000001,Vente,220000,5,,IMP DES ECUREUILS,0020,21490,21179,Clénay,21,,,21179000ZC0316,,,,,,,,,,,,,0,1,Maison,89,4,S,sols,,,259,5.124582,47.407273
2020-242189,2020-07-02,000002,Vente,60000,4,B,RTE DE MARSANNAY LE BOIS,0045,21490,21179,Clénay,21,,,211790000D0456,,,,,,,,,,,,,0,1,Maison,197,5,S,sols,,,312,5.124195,47.404794
2020-242432,2020-07-22,000001,Vente,345000,,,LES GRANDES VARENNES,B031,21490,21179,Clénay,21,,,21179000ZD0091,,,,,,,,,,,,,0,,,,,AB,terrains a bâtir,CHEM,Chemin (non groupe),249,5.115398,47.402325
2020-242432,2020-07-22,000001,Vente,345000,5,,IMP DU VAL DE NORGES,0067,21490,21179,Clénay,21,,,21179000ZD0092,,,,,,,,,,,,,0,1,Maison,105,4,S,sols,,,1106,5.115193,47.402431
2020-242819,2020-07-31,000001,Vente,437500,1,,RTE DE MARSANNAY LE BOIS,0045,21490,21179,Clénay,21,,,211790000D0075,,,,,,,,,,,,,0,1,Maison,185,6,S,sols,,,741,5.12332,47.404256
2020-244752,2020-09-02,000001,Vente,210000,3,,IMP DES ECUREUILS,0020,21490,21179,Clénay,21,,,21179000ZC0317,,,,,,,,,,,,,0,1,Maison,89,4,S,sols,,,258,5.124649,47.407194
2020-245098,2020-09-21,000001,Vente,259000,7,,RTE DE MARSANNAY LE BOIS,0045,21490,21179,Clénay,21,,,21179000ZC0162,,,,,,,,,,,,,0,1,Maison,104,6,S,sols,,,800,5.124028,47.405548
2020-246410,2020-10-30,000001,Vente,364660,,,AUX VARENNES D HAUTERIVE,B048,21490,21179,Clénay,21,,,21179000ZD0248,,,,,,,,,,,,,0,,,,,T,terres,,,482,5.111666,47.40211
2020-246410,2020-10-30,000001,Vente,364660,10,,RUE DES CHARDONS,0015,21490,21179,Clénay,21,,,21179000ZD0323,,,,,,,,,,,,,0,1,Maison,131,5,S,sols,,,765,5.111913,47.402687
2020-246410,2020-10-30,000001,Vente,364660,,,AUX VARENNES D HAUTERIVE,B048,21490,21179,Clénay,21,,,21179000ZD0324,,,,,,,,,,,,,0,,,,,S,sols,,,675,5.111801,47.402302
2020-246410,2020-10-30,000001,Vente,364660,,,AUX VARENNES D HAUTERIVE,B048,21490,21179,Clénay,21,,,21179000ZD0329,,,,,,,,,,,,,0,,,,,S,sols,,,66,5.111635,47.402556
2020-247837,2020-12-01,000002,Vente,1,,,AU NOYER COGNOT,B037,21490,21179,Clénay,21,,,21179000ZC0301,,,,,,,,,,,,,0,,,,,AB,terrains a bâtir,CHEM,Chemin (non groupe),2629,5.122278,47.406796
