id_mutation,date_mutation,numero_disposition,nature_mutation,valeur_fonciere,adresse_numero,adresse_suffixe,adresse_nom_voie,adresse_code_voie,code_postal,code_commune,nom_commune,code_departement,ancien_code_commune,ancien_nom_commune,id_parcelle,ancien_id_parcelle,numero_volume,lot1_numero,lot1_surface_carrez,lot2_numero,lot2_surface_carrez,lot3_numero,lot3_surface_carrez,lot4_numero,lot4_surface_carrez,lot5_numero,lot5_surface_carrez,nombre_lots,code_type_local,type_local,surface_reelle_bati,nombre_pieces_principales,code_nature_culture,nature_culture,code_nature_culture_speciale,nature_culture_speciale,surface_terrain,longitude,latitude
2020-236737,2020-02-07,000001,Vente,1000,,,LE VILLAGE,B166,21230,21374,Maligny,21,,,21374000AB0001,,,,,,,,,,,,,0,,,,,VE,vergers,,,650,4.503771,47.086724
2020-243304,2020-08-04,000002,Vente,110000,,,AU CHAMP GODARD,B028,21230,21374,Maligny,21,,,213740000C0283,,,,,,,,,,,,,0,,,,,P,prés,,,5031,4.512563,47.078417
2020-243304,2020-08-04,000002,Vente,110000,,,AU CHAMP GODARD,B028,21230,21374,Maligny,21,,,213740000C0284,,,,,,,,,,,,,0,,,,,T,terres,,,3412,4.514716,47.077568
2020-243304,2020-08-04,000002,Vente,110000,73,,RTE DE VELLEROT,0280,21230,21374,Maligny,21,,,213740000C0286,,,,,,,,,,,,,0,1,Maison,84,3,S,sols,,,2038,4.511626,47.07923
2020-243304,2020-08-04,000002,Vente,110000,,,AU CHAMP GODARD,B028,21230,21374,Maligny,21,,,213740000C0287,,,,,,,,,,,,,0,,,,,P,prés,,,9560,4.513192,47.07891
2020-243304,2020-08-04,000002,Vente,110000,,,AU CHAMP GODARD,B028,21230,21374,Maligny,21,,,213740000C0287,,,,,,,,,,,,,0,,,,,S,sols,,,40,4.513192,47.07891
2020-243304,2020-08-04,000002,Vente,110000,,,AU CHAMP GODARD,B028,21230,21374,Maligny,21,,,213740000C0510,,,,,,,,,,,,,0,,,,,T,terres,,,11124,4.513377,47.078422
2020-243304,2020-08-04,000002,Vente,110000,,,AU CHAMP GODARD,B028,21230,21374,Maligny,21,,,213740000C0511,,,,,,,,,,,,,0,,,,,T,terres,,,3373,4.515078,47.077856
2020-243304,2020-08-04,000002,Vente,110000,,,AU CHAMP GODARD,B028,21230,21374,Maligny,21,,,213740000C0543,,,,,,,,,,,,,0,,,,,PA,pâtures,,,776,4.511474,47.079311
2020-243304,2020-08-04,000002,Vente,110000,,,EN LICHARD,B095,21230,21374,Maligny,21,,,213740000C0558,,,,,,,,,,,,,0,,,,,P,prés,,,11617,4.515086,47.07888
2020-243304,2020-08-04,000002,Vente,110000,,,EN LICHARD,B095,21230,21374,Maligny,21,,,213740000C0564,,,,,,,,,,,,,0,,,,,P,prés,,,5343,4.513362,47.079918
2020-245839,2020-10-12,000001,Vente,465,,,EN PRECOT,B135,21230,21374,Maligny,21,,,213740000B0076,,,,,,,,,,,,,0,,,,,P,prés,,,3580,4.518815,47.089244
2020-246151,2020-10-17,000002,Vente,6600,5162,,EN LICHARD,B095,21230,21374,Maligny,21,,,213740000C0560,,,,,,,,,,,,,0,3,Dépendance,,0,S,sols,,,197,4.511619,47.081032
2020-246151,2020-10-17,000002,Vente,6600,,,EN LICHARD,B095,21230,21374,Maligny,21,,,213740000C0562,,,,,,,,,,,,,0,,,,,S,sols,,,23,4.511141,47.081123
2020-247146,2020-10-27,000001,Vente,15000,3,,RUE DE LA CROIX LICHARD,0045,21230,21374,Maligny,21,,,21374000AC0045,,,,,,,,,,,,,0,2,Appartement,31,2,S,sols,,,601,4.514692,47.08239
2020-247146,2020-10-27,000001,Vente,15000,3,,RUE DE LA CROIX LICHARD,0045,21230,21374,Maligny,21,,,21374000AC0045,,,,,,,,,,,,,0,2,Appartement,49,3,S,sols,,,601,4.514692,47.08239
2020-247146,2020-10-27,000001,Vente,15000,3,,RUE DE LA CROIX LICHARD,0045,21230,21374,Maligny,21,,,21374000AC0045,,,,,,,,,,,,,0,3,Dépendance,,0,S,sols,,,601,4.514692,47.08239
2020-247146,2020-10-27,000001,Vente,15000,3,,RUE DE LA CROIX LICHARD,0045,21230,21374,Maligny,21,,,21374000AC0045,,,,,,,,,,,,,0,3,Dépendance,,0,S,sols,,,601,4.514692,47.08239
2020-247146,2020-10-27,000001,Vente,15000,,,LE VILLAGE,B166,21230,21374,Maligny,21,,,21374000AC0047,,,,,,,,,,,,,0,,,,,S,sols,,,271,4.514876,47.08199
2020-247146,2020-10-27,000001,Vente,15000,5091,B,LE VILLAGE,B166,21230,21374,Maligny,21,,,21374000AC0049,,,,,,,,,,,,,0,3,Dépendance,,0,S,sols,,,521,4.514499,47.081956
2020-247457,2020-11-17,000001,Vente,8000,,,LE VILLAGE,B166,21230,21374,Maligny,21,,,21374000AB0208,,,,,,,,,,,,,0,,,,,AG,terrains d'agrément,,,757,4.506465,47.085971
2020-248958,2020-12-07,000001,Vente,9770,,,EN PRECOT,B135,21230,21374,Maligny,21,,,213740000B0065,,,,,,,,,,,,,0,,,,,T,terres,,,4101,4.513068,47.09249
