id_mutation,date_mutation,numero_disposition,nature_mutation,valeur_fonciere,adresse_numero,adresse_suffixe,adresse_nom_voie,adresse_code_voie,code_postal,code_commune,nom_commune,code_departement,ancien_code_commune,ancien_nom_commune,id_parcelle,ancien_id_parcelle,numero_volume,lot1_numero,lot1_surface_carrez,lot2_numero,lot2_surface_carrez,lot3_numero,lot3_surface_carrez,lot4_numero,lot4_surface_carrez,lot5_numero,lot5_surface_carrez,nombre_lots,code_type_local,type_local,surface_reelle_bati,nombre_pieces_principales,code_nature_culture,nature_culture,code_nature_culture_speciale,nature_culture_speciale,surface_terrain,longitude,latitude
2020-235886,2020-01-09,000001,Echange,9000,,,PIECE SAINT MARTIN,B082,21270,21398,Maxilly-sur-Saône,21,,,213980000D0257,,,,,,,,,,,,,0,,,,,P,prés,,,3137,5.418104,47.323404
2020-235886,2020-01-09,000001,Echange,9000,,,PIECE SAINT MARTIN,B082,21270,21398,Maxilly-sur-Saône,21,,,213980000D0261,,,,,,,,,,,,,0,,,,,P,prés,,,2175,5.418813,47.32702
2020-235886,2020-01-09,000001,Echange,9000,,,SUR LES MARAIS,B060,21270,21398,Maxilly-sur-Saône,21,,,213980000D0263,,,,,,,,,,,,,0,,,,,T,terres,,,9057,5.419081,47.325885
2020-235886,2020-01-09,000001,Echange,9000,,,PRES DU MARAIS,B088,21270,21398,Maxilly-sur-Saône,21,,,213980000D0279,,,,,,,,,,,,,0,,,,,BT,taillis simples,,,1623,5.413652,47.323274
2020-235886,2020-01-09,000001,Echange,9000,,,LES VARENNOTTES,B109,21270,21398,Maxilly-sur-Saône,21,,,213980000D0322,,,,,,,,,,,,,0,,,,,BT,taillis simples,,,1400,5.413192,47.321
2020-235886,2020-01-09,000001,Echange,9000,,,LES PRES DU ROI,B089,21270,21398,Maxilly-sur-Saône,21,,,213980000D0332,,,,,,,,,,,,,0,,,,,P,prés,,,11340,5.410381,47.31702
2020-235886,2020-01-09,000002,Echange,9000,,,EN SEU,B099,21270,21398,Maxilly-sur-Saône,21,,,213980000A0222,,,,,,,,,,,,,0,,,,,BT,taillis simples,,,617,5.427726,47.342022
2020-235886,2020-01-09,000002,Echange,9000,,,LES BAS PRES,B007,21270,21398,Maxilly-sur-Saône,21,,,213980000C0004,,,,,,,,,,,,,0,,,,,P,prés,,,3775,5.428323,47.324358
2020-235886,2020-01-09,000002,Echange,9000,,,LA NOUE AU MEU,B068,21270,21398,Maxilly-sur-Saône,21,,,213980000C0062,,,,,,,,,,,,,0,,,,,P,prés,,,1750,5.424154,47.31838
2020-235886,2020-01-09,000002,Echange,9000,,,SOUS LOUVIERE,B102,21270,21398,Maxilly-sur-Saône,21,,,213980000D0019,,,,,,,,,,,,,0,,,,,P,prés,,,2289,5.416169,47.327806
2020-235886,2020-01-09,000002,Echange,9000,,,SOUS LOUVIERE,B102,21270,21398,Maxilly-sur-Saône,21,,,213980000D0020,,,,,,,,,,,,,0,,,,,P,prés,,,2015,5.416411,47.327944
2020-235886,2020-01-09,000002,Echange,9000,,,CHAMPS DE RUSSEY,B016,21270,21398,Maxilly-sur-Saône,21,,,213980000D0023,,,,,,,,,,,,,0,,,,,P,prés,,,3951,5.416966,47.328225
2020-235886,2020-01-09,000002,Echange,9000,10,,RUE DES VIGNEUX,0175,21270,21398,Maxilly-sur-Saône,21,,,213980000D0024,,,,,,,,,,,,,0,,,,,S,sols,,,568,5.417284,47.328253
2020-235886,2020-01-09,000002,Echange,9000,,,CHAMPS DE RUSSEY,B016,21270,21398,Maxilly-sur-Saône,21,,,213980000D0025,,,,,,,,,,,,,0,,,,,P,prés,,,567,5.417228,47.328331
2020-235886,2020-01-09,000002,Echange,9000,,,CHAMPS DE RUSSEY,B016,21270,21398,Maxilly-sur-Saône,21,,,213980000D0036,,,,,,,,,,,,,0,,,,,P,prés,,,168,5.418676,47.327599
2020-235886,2020-01-09,000002,Echange,9000,,,CHAMPS DE RUSSEY,B016,21270,21398,Maxilly-sur-Saône,21,,,213980000D0037,,,,,,,,,,,,,0,,,,,P,prés,,,168,5.418527,47.327633
2020-235886,2020-01-09,000002,Echange,9000,,,LES TAFFONDS,B104,21270,21398,Maxilly-sur-Saône,21,,,213980000D0188,,,,,,,,,,,,,0,,,,,T,terres,,,592,5.429251,47.330809
2020-235886,2020-01-09,000002,Echange,9000,,,LES TAFFONDS,B104,21270,21398,Maxilly-sur-Saône,21,,,213980000D0190,,,,,,,,,,,,,0,,,,,T,terres,,,1460,5.429462,47.330995
2020-235886,2020-01-09,000002,Echange,9000,,,EZ GRANDS PRES,B035,21270,21398,Maxilly-sur-Saône,21,,,213980000D0224,,,,,,,,,,,,,0,,,,,T,terres,,,6430,5.430977,47.328635
2020-235886,2020-01-09,000002,Echange,9000,,,DEVANT LABORDE ET VIE MOUL,B030,21270,21398,Maxilly-sur-Saône,21,,,213980000E0016,,,,,,,,,,,,,0,,,,,BT,taillis simples,,,3310,5.402583,47.328804
2020-235886,2020-01-09,000002,Echange,9000,,,L AIGE A LA PIQUE,B003,21270,21398,Maxilly-sur-Saône,21,,,213980000E0397,,,,,,,,,,,,,0,,,,,T,terres,,,920,5.406106,47.329354
2020-236745,2020-01-23,000001,Vente,100000,6,,RTE DE TALMAY,0150,21270,21398,Maxilly-sur-Saône,21,,,21398000AC0011,,,,,,,,,,,,,0,1,Maison,90,4,S,sols,,,154,5.429614,47.335307
2020-237992,2020-02-20,000001,Vente,180000,9004,,RUE DES VIGNEUX,0175,21270,21398,Maxilly-sur-Saône,21,,,21398000AB0180,,,,,,,,,,,,,0,1,Maison,198,5,S,sols,,,500,5.424699,47.332003
2020-237992,2020-02-20,000001,Vente,180000,9004,,RUE DES VIGNEUX,0175,21270,21398,Maxilly-sur-Saône,21,,,21398000AB0180,,,,,,,,,,,,,0,1,Maison,198,5,J,jardins,,,360,5.424699,47.332003
2020-237992,2020-02-20,000001,Vente,180000,,,LES VIGNEUX,B113,21270,21398,Maxilly-sur-Saône,21,,,21398000AB0232,,,,,,,,,,,,,0,,,,,S,sols,,,483,5.424643,47.331928
2020-238042,2020-03-12,000001,Vente,9659.8,,,GRAND QUEULOT,B044,21270,21398,Maxilly-sur-Saône,21,,,21398000ZA0048,,,,,,,,,,,,,0,,,,,T,terres,,,2010,5.431875,47.346477
2020-238090,2020-03-12,000001,Vente,102000,1,,RTE DE PONTAILLER,0110,21270,21398,Maxilly-sur-Saône,21,,,21398000AB0089,,,,,,,,,,,,,0,4,Local industriel. commercial ou assimilé,52,0,S,sols,,,780,5.428868,47.334017
2020-238090,2020-03-12,000001,Vente,102000,1,,RTE DE PONTAILLER,0110,21270,21398,Maxilly-sur-Saône,21,,,21398000AB0089,,,,,,,,,,,,,0,1,Maison,115,6,S,sols,,,780,5.428868,47.334017
2020-238090,2020-03-12,000001,Vente,102000,,,LE VILLAGE,B114,21270,21398,Maxilly-sur-Saône,21,,,21398000AB0091,,,,,,,,,,,,,0,,,,,S,sols,,,237,5.428818,47.333856
2020-239823,2020-05-20,000001,Vente,45000,4,,RUE DE L EUROPE,0043,21270,21398,Maxilly-sur-Saône,21,,,21398000AB0068,,,,,,,,,,,,,0,3,Dépendance,,0,J,jardins,,,407,5.426998,47.333565
2020-239823,2020-05-20,000001,Vente,45000,4,,RUE DE L EUROPE,0043,21270,21398,Maxilly-sur-Saône,21,,,21398000AB0068,,,,,,,,,,,,,0,3,Dépendance,,0,S,sols,,,22,5.426998,47.333565
2020-239823,2020-05-20,000001,Vente,45000,,,LE VILLAGE,B114,21270,21398,Maxilly-sur-Saône,21,,,21398000AB0069,,,,,,,,,,,,,0,,,,,S,sols,,,102,5.427093,47.333473
2020-239823,2020-05-20,000001,Vente,45000,4,,RUE DE L EUROPE,0043,21270,21398,Maxilly-sur-Saône,21,,,21398000AB0073,,,,,,,,,,,,,0,1,Maison,140,5,S,sols,,,175,5.427344,47.333363
2020-241155,2020-06-26,000001,Vente,199000,1,,RTE D HEUILLEY,0075,21270,21398,Maxilly-sur-Saône,21,,,21398000AC0010,,,,,,,,,,,,,0,1,Maison,160,4,S,sols,,,527,5.42975,47.335244
2020-241155,2020-06-26,000001,Vente,199000,,,PETIT MORAMBERT,B074,21270,21398,Maxilly-sur-Saône,21,,,21398000AC0013,,,,,,,,,,,,,0,,,,,J,jardins,,,1509,5.430055,47.335368
2020-242702,2020-07-16,000001,Echange,500,,,EZ GRANDS PRES,B035,21270,21398,Maxilly-sur-Saône,21,,,213980000D0194,,,,,,,,,,,,,0,,,,,T,terres,,,698,5.429637,47.330592
2020-242702,2020-07-16,000002,Echange,500,,,LES TAFFONDS,B104,21270,21398,Maxilly-sur-Saône,21,,,21398000AB0140,,,,,,,,,,,,,0,,,,,T,terres,,,915,5.427592,47.331309
2020-243626,2020-08-06,000001,Vente,7000,,,LA FRACASSE,B041,21270,21398,Maxilly-sur-Saône,21,,,213980000D0229,,,,,,,,,,,,,0,,,,,P,prés,,,39500,5.423965,47.324488
2020-244996,2020-09-17,000001,Vente,120000,9,,RTE DE SAINT SAUVEUR,0130,21270,21398,Maxilly-sur-Saône,21,,,21398000AB0054,,,,,,,,,,,,,0,1,Maison,105,4,S,sols,,,1181,5.426418,47.334351
2020-245953,2020-10-12,000001,Vente,129000,13,,RTE DE PONTAILLER,0110,21270,21398,Maxilly-sur-Saône,21,,,21398000AB0109,,,,,,,,,,,,,0,1,Maison,100,5,S,sols,,,916,5.428243,47.332608
2020-247462,2020-11-19,000001,Vente,20000,2,,RUE DE BOURGOGNE,0015,21270,21398,Maxilly-sur-Saône,21,,,21398000AB0210,,,,,,,,,,,,,0,3,Dépendance,,0,S,sols,,,629,5.42643,47.334025
2020-247462,2020-11-19,000001,Vente,20000,2,,RUE DE BOURGOGNE,0015,21270,21398,Maxilly-sur-Saône,21,,,21398000AB0210,,,,,,,,,,,,,0,1,Maison,70,3,S,sols,,,629,5.42643,47.334025
2020-249427,2020-12-22,000001,Vente,135000,9003,,RUE DES VIGNEUX,0175,21270,21398,Maxilly-sur-Saône,21,,,213980000D0488,,,,,,,,,,,,,0,1,Maison,92,5,S,sols,,,656,5.423319,47.332497
2020-249427,2020-12-22,000001,Vente,135000,,,LES VIGNEUX,B113,21270,21398,Maxilly-sur-Saône,21,,,213980000D0490,,,,,,,,,,,,,0,,,,,S,sols,,,487,5.4233,47.332346
2020-249427,2020-12-22,000001,Vente,135000,,,LES VIGNEUX,B113,21270,21398,Maxilly-sur-Saône,21,,,213980000D0492,,,,,,,,,,,,,0,,,,,BT,taillis simples,,,14,5.423133,47.332581
2020-249427,2020-12-22,000001,Vente,135000,,,LES VIGNEUX,B113,21270,21398,Maxilly-sur-Saône,21,,,213980000D0495,,,,,,,,,,,,,0,,,,,S,sols,,,23,5.423046,47.332522
2020-249758,2020-12-23,000001,Vente,48000,,,LE VILLAGE,B114,21270,21398,Maxilly-sur-Saône,21,,,21398000AB0255,,,,,,,,,,,,,0,,,,,AB,terrains a bâtir,,,836,5.428593,47.331932
