id_mutation,date_mutation,numero_disposition,nature_mutation,valeur_fonciere,adresse_numero,adresse_suffixe,adresse_nom_voie,adresse_code_voie,code_postal,code_commune,nom_commune,code_departement,ancien_code_commune,ancien_nom_commune,id_parcelle,ancien_id_parcelle,numero_volume,lot1_numero,lot1_surface_carrez,lot2_numero,lot2_surface_carrez,lot3_numero,lot3_surface_carrez,lot4_numero,lot4_surface_carrez,lot5_numero,lot5_surface_carrez,nombre_lots,code_type_local,type_local,surface_reelle_bati,nombre_pieces_principales,code_nature_culture,nature_culture,code_nature_culture_speciale,nature_culture_speciale,surface_terrain,longitude,latitude
2020-256798,2020-01-16,000001,Vente,600,,,LA BORGNAIS,B111,22250,22114,Lanrelas,22,,,22114000ZT0116,,,,,,,,,,,,,0,,,,,BT,taillis simples,,,1680,-2.303807,48.227733
2020-256891,2020-02-03,000001,Vente,89000,4,,RUE DE LA TOUCHE ES PIAUDIAUX,0295,22250,22114,Lanrelas,22,,,22114000YB0035,,,,,,,,,,,,,0,1,Maison,89,3,S,sols,,,960,-2.300317,48.250197
2020-256905,2020-01-17,000001,Vente,63000,,,LA VILLE LOUAIS,D674,22250,22114,Lanrelas,22,,,22114000YA0069,,,,,,,,,,,,,0,,,,,S,sols,,,473,-2.324783,48.251076
2020-256905,2020-01-17,000001,Vente,63000,24,,LA VILLE LOUAIS,D674,22250,22114,Lanrelas,22,,,22114000YA0072,,,,,,,,,,,,,0,1,Maison,80,3,S,sols,,,499,-2.324979,48.251078
2020-256905,2020-01-17,000001,Vente,63000,,,LA VILLE LOUAIS,D674,22250,22114,Lanrelas,22,,,22114000YA0073,,,,,,,,,,,,,0,,,,,S,sols,,,183,-2.325043,48.251046
2020-257094,2020-02-11,000001,Vente,60000,37,,LA CHAUMIERE,B285,22250,22114,Lanrelas,22,,,22114000ZB0083,,,,,,,,,,,,,0,1,Maison,104,3,S,sols,,,296,-2.292566,48.279444
2020-257094,2020-02-11,000001,Vente,60000,37,,LA CHAUMIERE,B285,22250,22114,Lanrelas,22,,,22114000ZB0083,,,,,,,,,,,,,0,1,Maison,104,3,J,jardins,,,744,-2.292566,48.279444
2020-257094,2020-02-11,000001,Vente,60000,,,LA CHAUMIERE,B285,22250,22114,Lanrelas,22,,,22114000ZB0084,,,,,,,,,,,,,0,,,,,J,jardins,,,800,-2.292424,48.2795
2020-257094,2020-02-11,000001,Vente,60000,,,LA CHAUMIERE,B285,22250,22114,Lanrelas,22,,,22114000ZB0084,,,,,,,,,,,,,0,,,,,S,sols,,,140,-2.292424,48.2795
2020-257094,2020-02-11,000001,Vente,60000,,,LA CHAUMIERE,B285,22250,22114,Lanrelas,22,,,22114000ZB0085,,,,,,,,,,,,,0,,,,,S,sols,,,240,-2.292334,48.279341
2020-257094,2020-02-11,000001,Vente,60000,,,LA DEUVE,C068,22250,22114,Lanrelas,22,,,22114000ZC0044,,,,,,,,,,,,,0,,,,,BT,taillis simples,,,1840,-2.286689,48.277052
2020-257132,2020-02-21,000001,Vente,30000,,,LE BOURG,B122,22250,22114,Lanrelas,22,,,221140000F1220,,,,,,,,,,,,,0,,,,,AB,terrains a bâtir,,,1438,-2.296319,48.253168
2020-257261,2020-02-17,000001,Vente,69000,,,LA BROUSSE,B134,22250,22114,Lanrelas,22,,,22114000YE0072,,,,,,,,,,,,,0,,,,,J,jardins,,,940,-2.29411,48.227411
2020-257261,2020-02-17,000001,Vente,69000,12,,LA BROUSSE,B134,22250,22114,Lanrelas,22,,,22114000YE0084,,,,,,,,,,,,,0,1,Maison,175,5,S,sols,,,760,-2.294615,48.227965
2020-257422,2020-03-11,000001,Vente,5610,,,LE BOIS DE SAINT REGENT,B081,22250,22114,Lanrelas,22,,,22114000ZR0004,,,,,,,,,,,,,0,,,,,T,terres,,,9350,-2.276052,48.220819
2020-257423,2020-03-11,000001,Vente,41490,,,LA VILLE REALLAND,D689,22250,22114,Lanrelas,22,,,22114000YD0040,,,,,,,,,,,,,0,,,,,T,terres,,,1540,-2.290664,48.235838
2020-257423,2020-03-11,000001,Vente,41490,,,LA VILLE REALLAND,D689,22250,22114,Lanrelas,22,,,22114000YD0040,,,,,,,,,,,,,0,,,,,T,terres,,,1540,-2.290664,48.235838
2020-257423,2020-03-11,000001,Vente,41490,,,LA VILLE REALLAND,D689,22250,22114,Lanrelas,22,,,22114000YD0138,,,,,,,,,,,,,0,,,,,T,terres,,,8522,-2.291205,48.237452
2020-257423,2020-03-11,000001,Vente,41490,,,LA VILLE REALLAND,D689,22250,22114,Lanrelas,22,,,22114000YD0138,,,,,,,,,,,,,0,,,,,T,terres,,,25565,-2.291205,48.237452
2020-257423,2020-03-11,000001,Vente,41490,,,LA BROUSSE,B134,22250,22114,Lanrelas,22,,,22114000YE0064,,,,,,,,,,,,,0,,,,,BP,peupleraies,,,520,-2.287058,48.230322
2020-257423,2020-03-11,000001,Vente,41490,,,LA BROUSSE,B134,22250,22114,Lanrelas,22,,,22114000YE0065,,,,,,,,,,,,,0,,,,,T,terres,,,3900,-2.287804,48.230441
2020-257423,2020-03-11,000001,Vente,41490,,,LA BROUSSE,B134,22250,22114,Lanrelas,22,,,22114000YE0104,,,,,,,,,,,,,0,,,,,T,terres,,,4800,-2.291823,48.23157
2020-257423,2020-03-11,000001,Vente,41490,,,LA BONNE FONTAINE,B107,22250,22114,Lanrelas,22,,,22114000ZM0067,,,,,,,,,,,,,0,,,,,T,terres,,,10000,-2.286918,48.243701
2020-257423,2020-03-11,000001,Vente,41490,,,LE PONT GESBERT,D218,22250,22114,Lanrelas,22,,,22114000ZM0070,,,,,,,,,,,,,0,,,,,T,terres,,,5080,-2.292211,48.244612
2020-257423,2020-03-11,000001,Vente,41490,,,LE BOIS DE SAINT REGENT,B081,22250,22114,Lanrelas,22,,,22114000ZR0005,,,,,,,,,,,,,0,,,,,T,terres,,,9220,-2.276964,48.220839
2020-257429,2020-02-26,000001,Vente,1907.67,,,SAINT REGENT,D575,22250,22114,Lanrelas,22,,,22114000ZN0069,,,,,,,,,,,,,0,,,,,P,prés,,,3920,-2.27917,48.234514
2020-257429,2020-02-26,000001,Vente,1907.67,,,LES LANDES DE KERBENEUC,C871,22250,22114,Lanrelas,22,,,22114000ZP0069,,,,,,,,,,,,,0,,,,,T,terres,,,10540,-2.274193,48.222048
2020-257545,2020-03-27,000002,Vente,57500,,,LE COURTIL COLLET,B811,22250,22114,Lanrelas,22,,,221140000C1691,,,,,,,,,,,,,0,,,,,J,jardins,,,240,-2.290674,48.250034
2020-257545,2020-03-27,000002,Vente,57500,,,LE COURTIL COLLET,B811,22250,22114,Lanrelas,22,,,221140000C1691,,,,,,,,,,,,,0,,,,,T,terres,,,205,-2.290674,48.250034
2020-257545,2020-03-27,000002,Vente,57500,,,LA CHEMERRIERE DU JARDIN,B289,22250,22114,Lanrelas,22,,,221140000C1850,,,,,,,,,,,,,0,,,,,S,sols,,,387,-2.290595,48.250598
2020-257545,2020-03-27,000002,Vente,57500,,,LA CHEMERRIERE DU JARDIN,B289,22250,22114,Lanrelas,22,,,221140000C1851,,,,,,,,,,,,,0,,,,,S,sols,,,5,-2.290565,48.250401
2020-257631,2020-04-20,000001,Vente,88000,3,,RUE DES AULNAIES,0010,22250,22114,Lanrelas,22,,,221140000C0053,,,,,,,,,,,,,0,1,Maison,100,3,S,sols,,,320,-2.292245,48.251836
2020-257631,2020-04-20,000001,Vente,88000,,,LE COURTIL DU PRE,B929,22250,22114,Lanrelas,22,,,221140000C1765,,,,,,,,,,,,,0,,,,,J,jardins,,,185,-2.292398,48.251838
2020-257631,2020-04-20,000001,Vente,88000,,,LE BOURG,B122,22250,22114,Lanrelas,22,,,221140000C1766,,,,,,,,,,,,,0,,,,,S,sols,,,84,-2.292501,48.251864
2020-257673,2020-04-20,000001,Vente,1500,,,CHIRPEL,B316,22250,22114,Lanrelas,22,,,22114000ZH0071,,,,,,,,,,,,,0,,,,,T,terres,,,2280,-2.296132,48.262935
2020-257800,2020-04-10,000001,Vente,147600,7,,LA VILLE ES MORIAUX,D665,22250,22114,Lanrelas,22,,,22114000ZM0083,,,,,,,,,,,,,0,1,Maison,135,4,J,jardins,,,4730,-2.293177,48.240446
2020-257800,2020-04-10,000001,Vente,147600,7,,LA VILLE ES MORIAUX,D665,22250,22114,Lanrelas,22,,,22114000ZM0083,,,,,,,,,,,,,0,1,Maison,135,4,S,sols,,,1000,-2.293177,48.240446
2020-258153,2020-06-08,000002,Echange,1000,,,LE COURTIL BOEVIN,B798,22250,22114,Lanrelas,22,,,221140000C1843,,,,,,,,,,,,,0,,,,,T,terres,,,261,-2.292182,48.251213
2020-258153,2020-06-08,000003,Echange,1000,,,LE COURTIL BOEVIN,B798,22250,22114,Lanrelas,22,,,221140000C1841,,,,,,,,,,,,,0,,,,,S,sols,,,188,-2.292259,48.250955
2020-258153,2020-06-08,000003,Echange,1000,,,LE COURTIL BOEVIN,B798,22250,22114,Lanrelas,22,,,221140000C1845,,,,,,,,,,,,,0,,,,,T,terres,,,148,-2.292079,48.251449
2020-258536,2020-07-18,000001,Vente,5500,,,LA TOUCHE ES PIAUDIAUX,D597,22250,22114,Lanrelas,22,,,22114000YC0020,,,,,,,,,,,,,0,,,,,T,terres,,,2380,-2.3003,48.248302
2020-258546,2020-06-30,000001,Vente,5000,29,,LA VIGNE,D644,22250,22114,Lanrelas,22,,,22114000ZH0078,,,,,,,,,,,,,0,3,Dépendance,,0,S,sols,,,420,-2.295376,48.260499
2020-258546,2020-06-30,000001,Vente,5000,29,,LA VIGNE,D644,22250,22114,Lanrelas,22,,,22114000ZH0078,,,,,,,,,,,,,0,3,Dépendance,,0,T,terres,,,2260,-2.295376,48.260499
2020-258547,2020-06-30,000002,Vente,25000,,,LA VIGNE,D644,22250,22114,Lanrelas,22,,,22114000ZH0077,,,,,,,,,,,,,0,4,Local industriel. commercial ou assimilé,270,0,T,terres,,,12100,-2.29516,48.261158
2020-258547,2020-06-30,000002,Vente,25000,,,LA VIGNE,D644,22250,22114,Lanrelas,22,,,22114000ZH0077,,,,,,,,,,,,,0,4,Local industriel. commercial ou assimilé,270,0,S,sols,,,1400,-2.29516,48.261158
2020-258815,2020-08-12,000001,Vente,108000,5315,,LE VAL DE RANCE,D617,22250,22114,Lanrelas,22,,,22114000ZH0250,,,,,,,,,,,,,0,3,Dépendance,,0,S,sols,,,1308,-2.312402,48.257065
2020-258815,2020-08-12,000001,Vente,108000,5315,,LE VAL DE RANCE,D617,22250,22114,Lanrelas,22,,,22114000ZH0250,,,,,,,,,,,,,0,3,Dépendance,,0,T,terres,,,1216,-2.312402,48.257065
2020-258815,2020-08-12,000001,Vente,108000,5315,,LE VAL DE RANCE,D617,22250,22114,Lanrelas,22,,,22114000ZH0250,,,,,,,,,,,,,0,1,Maison,105,3,T,terres,,,1216,-2.312402,48.257065
2020-258815,2020-08-12,000001,Vente,108000,5315,,LE VAL DE RANCE,D617,22250,22114,Lanrelas,22,,,22114000ZH0250,,,,,,,,,,,,,0,1,Maison,105,3,S,sols,,,1308,-2.312402,48.257065
2020-258961,2020-08-31,000001,Vente,103000,27,,LA VIEUXVILLE,D643,22250,22114,Lanrelas,22,,,22114000ZB0007,,,,,,,,,,,,,0,1,Maison,93,3,S,sols,,,720,-2.308606,48.284899
2020-258961,2020-08-31,000001,Vente,103000,27,,LA VIEUXVILLE,D643,22250,22114,Lanrelas,22,,,22114000ZB0007,,,,,,,,,,,,,0,1,Maison,93,3,T,terres,,,1780,-2.308606,48.284899
2020-259007,2020-09-10,000001,Vente,50000,4,,IMP DU BOIS PIGNON,0017,22250,22114,Lanrelas,22,,,22114000YB0067,,,,,,,,,,,,,0,1,Maison,110,5,J,jardins,,,1455,-2.30332,48.248916
2020-259007,2020-09-10,000001,Vente,50000,4,,IMP DU BOIS PIGNON,0017,22250,22114,Lanrelas,22,,,22114000YB0067,,,,,,,,,,,,,0,1,Maison,110,5,S,sols,,,425,-2.30332,48.248916
2020-259150,2020-06-30,000001,Vente,80000,2,,RUE DU CLOS FLEURI,0070,22250,22114,Lanrelas,22,,,221140000C1552,,,,,,,,,,,,,0,1,Maison,73,4,T,terres,,,545,-2.296467,48.249402
2020-259150,2020-06-30,000001,Vente,80000,2,,RUE DU CLOS FLEURI,0070,22250,22114,Lanrelas,22,,,221140000C1552,,,,,,,,,,,,,0,1,Maison,73,4,S,sols,,,500,-2.296467,48.249402
2020-259181,2020-09-04,000001,Vente,20113.35,,,LE BOIS COLLET,B064,22250,22114,Lanrelas,22,,,22114000ZS0057,,,,,,,,,,,,,0,,,,,T,terres,,,37170,-2.287928,48.21652
2020-259181,2020-09-04,000001,Vente,20113.35,,,LE BOIS COLLET,B064,22250,22114,Lanrelas,22,,,22114000ZS0057,,,,,,,,,,,,,0,,,,,L,landes,,,4200,-2.287928,48.21652
2020-259182,2020-09-04,000001,Vente,3312,,,LE BOIS COLLET,B064,22250,22114,Lanrelas,22,,,22114000ZS0056,,,,,,,,,,,,,0,,,,,T,terres,,,9720,-2.287293,48.215592
2020-259211,2020-09-04,000001,Vente,28451.43,,,LE BOIS DE SAINT REGENT,B081,22250,22114,Lanrelas,22,,,22114000ZR0003,,,,,,,,,,,,,0,,,,,T,terres,,,19640,-2.275669,48.221087
2020-259211,2020-09-04,000001,Vente,28451.43,,,LE BOIS COLLET,B064,22250,22114,Lanrelas,22,,,22114000ZS0043,,,,,,,,,,,,,0,,,,,T,terres,,,34800,-2.28289,48.216851
2020-259211,2020-09-04,000001,Vente,28451.43,,,LE BOIS COLLET,B064,22250,22114,Lanrelas,22,,,22114000ZS0043,,,,,,,,,,,,,0,,,,,BT,taillis simples,,,4080,-2.28289,48.216851
2020-259274,2020-09-30,000001,Vente,112000,,,SAINT MALO,D574,22250,22114,Lanrelas,22,,,22114000ZB0131,,,,,,,,,,,,,0,,,,,AG,terrains d'agrément,JARD,Jardin d'agrément,793,-2.301557,48.279592
2020-259274,2020-09-30,000001,Vente,112000,,,SAINT MALO,D574,22250,22114,Lanrelas,22,,,22114000ZB0131,,,,,,,,,,,,,0,,,,,VE,vergers,POMME,Pommiers,2247,-2.301557,48.279592
2020-259274,2020-09-30,000001,Vente,112000,41,,SAINT MALO,D574,22250,22114,Lanrelas,22,,,22114000ZB0201,,,,,,,,,,,,,0,1,Maison,125,2,S,sols,,,942,-2.301355,48.279409
2020-259367,2020-10-02,000001,Vente,500,,,LA BROUSSE,B134,22250,22114,Lanrelas,22,,,22114000YE0083,,,,,,,,,,,,,0,,,,,T,terres,,,270,-2.294854,48.227867
2020-259367,2020-10-02,000001,Vente,500,,,LA BROUSSE,B134,22250,22114,Lanrelas,22,,,22114000YE0090,,,,,,,,,,,,,0,,,,,S,sols,,,640,-2.295178,48.228131
2020-259427,2020-09-30,000001,Vente,68120,3,,RUE DE LA VIGNE,0340,22250,22114,Lanrelas,22,,,221140000B1413,,,,,,,,,,,,,0,1,Maison,68,4,S,sols,,,805,-2.293099,48.256683
2020-259567,2020-10-16,000001,Vente,30000,,,LA HOUILNAIS,C557,22250,22114,Lanrelas,22,,,22114000ZK0177,,,,,,,,,,,,,0,,,,,T,terres,,,46717,-2.280301,48.25885
2020-259573,2020-10-21,000001,Vente,130000,27,,SAINT REGENT,D575,22250,22114,Lanrelas,22,,,22114000ZN0048,,,,,,,,,,,,,0,1,Maison,150,5,S,sols,,,520,-2.276464,48.23411
2020-259573,2020-10-21,000001,Vente,130000,27,,SAINT REGENT,D575,22250,22114,Lanrelas,22,,,22114000ZN0048,,,,,,,,,,,,,0,1,Maison,150,5,T,terres,,,480,-2.276464,48.23411
2020-259573,2020-10-21,000001,Vente,130000,27,,SAINT REGENT,D575,22250,22114,Lanrelas,22,,,22114000ZN0048,,,,,,,,,,,,,0,1,Maison,150,5,T,terres,,,600,-2.276464,48.23411
2020-259573,2020-10-21,000001,Vente,130000,,,SAINT REGENT,D575,22250,22114,Lanrelas,22,,,22114000ZN0050,,,,,,,,,,,,,0,,,,,T,terres,,,2400,-2.276263,48.233696
2020-259687,2020-10-28,000002,Vente,45000,,,SAINT REGENT,D575,22250,22114,Lanrelas,22,,,22114000ZN0052,,,,,,,,,,,,,0,,,,,J,jardins,,,320,-2.276426,48.23324
2020-259687,2020-10-28,000002,Vente,45000,,,SAINT REGENT,D575,22250,22114,Lanrelas,22,,,22114000ZN0052,,,,,,,,,,,,,0,,,,,T,terres,,,2620,-2.276426,48.23324
2020-259687,2020-10-28,000002,Vente,45000,29,,SAINT REGENT,D575,22250,22114,Lanrelas,22,,,22114000ZN0169,,,,,,,,,,,,,0,1,Maison,55,2,S,sols,,,2035,-2.276871,48.233551
2020-259788,2020-10-23,000001,Vente,68000,15,,LE TOCARD,D594,22250,22114,Lanrelas,22,,,22114000ZE0090,,,,,,,,,,,,,0,1,Maison,71,4,T,terres,,,377,-2.315348,48.264409
2020-259788,2020-10-23,000001,Vente,68000,15,,LE TOCARD,D594,22250,22114,Lanrelas,22,,,22114000ZE0090,,,,,,,,,,,,,0,1,Maison,71,4,S,sols,,,364,-2.315348,48.264409
2020-259788,2020-10-23,000001,Vente,68000,,,LE TOCARD,D594,22250,22114,Lanrelas,22,,,22114000ZE0094,,,,,,,,,,,,,0,,,,,S,sols,,,10,-2.315199,48.264299
2020-259788,2020-10-23,000001,Vente,68000,,,LE TOCARD,D594,22250,22114,Lanrelas,22,,,22114000ZE0116,,,,,,,,,,,,,0,,,,,T,terres,,,323,-2.315389,48.264213
2020-260136,2020-10-30,000001,Vente,157000,,,LA GUENAIS,C521,22250,22114,Lanrelas,22,,,22114000ZH0028,,,,,,,,,,,,,0,,,,,T,terres,,,940,-2.303073,48.260259
2020-260136,2020-10-30,000001,Vente,157000,11,,LA GUENAIS,C521,22250,22114,Lanrelas,22,,,22114000ZH0029,,,,,,,,,,,,,0,1,Maison,181,6,S,sols,,,1100,-2.303283,48.260714
2020-260136,2020-10-30,000001,Vente,157000,11,,LA GUENAIS,C521,22250,22114,Lanrelas,22,,,22114000ZH0029,,,,,,,,,,,,,0,1,Maison,181,6,J,jardins,,,480,-2.303283,48.260714
2020-260229,2020-12-11,000001,Vente,107000,11,,RUE DES MIMOSAS,0170,22250,22114,Lanrelas,22,,,221140000B1451,,,,,,,,,,,,,0,1,Maison,80,5,S,sols,,,935,-2.293147,48.25594
2020-260229,2020-12-11,000001,Vente,107000,,,LES PONTS,D224,22250,22114,Lanrelas,22,,,221140000B1689,,,,,,,,,,,,,0,,,,,J,jardins,,,72,-2.293261,48.255728
2020-260461,2020-12-23,000001,Vente,45000,14,,RUE DES ROSES,0270,22250,22114,Lanrelas,22,,,221140000C1446,,,,,,,,,,,,,0,1,Maison,90,5,S,sols,,,681,-2.296281,48.249801
2020-260489,2020-12-01,000001,Vente,30000,4,,GIRONNE,C206,22250,22114,Lanrelas,22,,,22114000ZH0006,,,,,,,,,,,,,0,1,Maison,42,3,T,terres,,,3360,-2.313583,48.26085
2020-260489,2020-12-01,000001,Vente,30000,4,,GIRONNE,C206,22250,22114,Lanrelas,22,,,22114000ZH0006,,,,,,,,,,,,,0,1,Maison,42,3,S,sols,,,1520,-2.313583,48.26085
