id_mutation,date_mutation,numero_disposition,nature_mutation,valeur_fonciere,adresse_numero,adresse_suffixe,adresse_nom_voie,adresse_code_voie,code_postal,code_commune,nom_commune,code_departement,ancien_code_commune,ancien_nom_commune,id_parcelle,ancien_id_parcelle,numero_volume,lot1_numero,lot1_surface_carrez,lot2_numero,lot2_surface_carrez,lot3_numero,lot3_surface_carrez,lot4_numero,lot4_surface_carrez,lot5_numero,lot5_surface_carrez,nombre_lots,code_type_local,type_local,surface_reelle_bati,nombre_pieces_principales,code_nature_culture,nature_culture,code_nature_culture_speciale,nature_culture_speciale,surface_terrain,longitude,latitude
2020-267921,2020-01-16,000001,Vente,85000,35,,GR GRANDE RUE,0400,23150,23001,Ahun,23,,,23001000AD0265,,,,,,,,,,,,,0,2,Appartement,34,1,S,sols,,,80,2.044375,46.086813
2020-267921,2020-01-16,000001,Vente,85000,35,,GR GRANDE RUE,0400,23150,23001,Ahun,23,,,23001000AD0265,,,,,,,,,,,,,0,2,Appartement,47,2,S,sols,,,80,2.044375,46.086813
2020-267921,2020-01-16,000001,Vente,85000,35,,GR GRANDE RUE,0400,23150,23001,Ahun,23,,,23001000AD0265,,,,,,,,,,,,,0,4,Local industriel. commercial ou assimilé,59,0,S,sols,,,80,2.044375,46.086813
2020-268038,2020-02-03,000001,Vente,32000,92,,BUSSEAU SUR CREUSE,B029,23150,23001,Ahun,23,,,23001000AC0126,,,,,,,,,,,,,0,1,Maison,85,4,S,sols,,,170,2.017052,46.117552
2020-268072,2020-01-17,000001,Vente,38000,2,,RUE DU DOCTEUR MAUMY,0270,23150,23001,Ahun,23,,,23001000AE0021,,,,,,,,,,,,,0,1,Maison,65,3,S,sols,,,65,2.044511,46.084618
2020-268240,2020-02-11,000002,Vente,55200,3,,RTE DU MOUTIER,0320,23150,23001,Ahun,23,,,230010000D0582,,,,,,,,,,,,,0,,,,,S,sols,,,779,2.045974,46.088822
2020-268360,2020-03-03,000001,Vente,1,,,TRIDENT,B389,23150,23001,Ahun,23,,,23001000ZK0143,,,,,,,,,,,,,0,,,,,T,terres,,,2205,2.044358,46.076961
2020-268360,2020-03-03,000001,Vente,1,,,TRIDENT,B389,23150,23001,Ahun,23,,,23001000ZK0147,,,,,,,,,,,,,0,,,,,T,terres,,,144,2.044338,46.076683
2020-268656,2020-03-31,000001,Vente,600,,,LES BREGEAUX,B025,23150,23001,Ahun,23,,,230010000C0451,,,,,,,,,,,,,0,,,,,BT,taillis simples,,,615,2.020364,46.109152
2020-268730,2020-04-28,000001,Vente,,5582,,LE MAS DU THEIL,B211,23150,23001,Ahun,23,,,230010000D0419,,,,,,,,,,,,,0,1,Maison,82,4,S,sols,,,770,2.037533,46.090094
2020-268730,2020-04-28,000002,Vente,,5583,,LE MAS DU THEIL,B211,23150,23001,Ahun,23,,,230010000D0420,,,,,,,,,,,,,0,1,Maison,53,1,S,sols,,,550,2.037681,46.0902
2020-268730,2020-04-28,000002,Vente,,,,LE MAS DU THEIL,B211,23150,23001,Ahun,23,,,230010000D0422,,,,,,,,,,,,,0,,,,,L,landes,,,445,2.037931,46.090858
2020-268730,2020-04-28,000002,Vente,,,,LE MAS DU THEIL,B211,23150,23001,Ahun,23,,,230010000D0447,,,,,,,,,,,,,0,,,,,T,terres,,,4135,2.037732,46.090563
2020-268921,2020-04-29,000001,Vente,43000,3,,PL DU DOCTEUR COUDERC,0100,23150,23001,Ahun,23,,,23001000AD0207,,,,,,,,,,,,,0,1,Maison,92,5,S,sols,,,84,2.045891,46.086866
2020-268931,2020-05-12,000001,Vente,16500,,,LE MAS DU THEIL,B211,23150,23001,Ahun,23,,,230010000D0411,,,,,,,,,,,,,0,,,,,BT,taillis simples,,,3705,2.038533,46.089302
2020-268931,2020-05-12,000001,Vente,16500,,,LE MAS DU THEIL,B211,23150,23001,Ahun,23,,,230010000D0412,,,,,,,,,,,,,0,,,,,S,sols,,,200,2.037915,46.089534
2020-268931,2020-05-12,000001,Vente,16500,,,LE MAS DU THEIL,B211,23150,23001,Ahun,23,,,230010000D0413,,,,,,,,,,,,,0,,,,,L,landes,,,3820,2.037916,46.089531
2020-268931,2020-05-12,000001,Vente,16500,,,LE MAS DU THEIL,B211,23150,23001,Ahun,23,,,230010000D0416,,,,,,,,,,,,,0,,,,,L,landes,,,135,2.037341,46.089878
2020-268931,2020-05-12,000001,Vente,16500,,,LE MAS DU THEIL,B211,23150,23001,Ahun,23,,,230010000D0418,,,,,,,,,,,,,0,,,,,L,landes,,,62,2.037657,46.089933
2020-268938,2020-05-26,000001,Vente,34850,,,PIERREFITTE,B266,23150,23001,Ahun,23,,,23001000AM0014,,,,,,,,,,,,,0,,,,,S,sols,,,97,1.996399,46.078999
2020-268938,2020-05-26,000001,Vente,34850,,,PIERREFITTE,B266,23150,23001,Ahun,23,,,23001000AM0018,,,,,,,,,,,,,0,,,,,J,jardins,,,316,1.996783,46.078715
2020-268938,2020-05-26,000001,Vente,34850,47,,PIERREFITTE,B266,23150,23001,Ahun,23,,,23001000AM0050,,,,,,,,,,,,,0,1,Maison,78,2,S,sols,,,116,1.996841,46.078453
2020-268938,2020-05-26,000001,Vente,34850,,,PIERREFITTE,B266,23150,23001,Ahun,23,,,23001000AM0051,,,,,,,,,,,,,0,,,,,L,landes,,,25,1.996738,46.078388
2020-269078,2020-03-31,000001,Vente,101500,72,,RTE DE LIMOGES,0200,23150,23001,Ahun,23,,,23001000AE0222,,,,,,,,,,,,,0,1,Maison,62,3,S,sols,,,230,2.043634,46.08188
2020-269078,2020-03-31,000001,Vente,101500,72,,RTE DE LIMOGES,0200,23150,23001,Ahun,23,,,23001000AE0222,,,,,,,,,,,,,0,1,Maison,62,3,T,terres,,,901,2.043634,46.08188
2020-269806,2020-08-07,000001,Vente,3069,,,LA COTE,B110,23150,23001,Ahun,23,,,230010000C0534,,,,,,,,,,,,,0,,,,,P,prés,,,16569,2.036349,46.119145
2020-269957,2020-08-27,000001,Vente,15000,,,AU BOURG,B358,23150,23001,Ahun,23,,,23001000AE0143,,,,,,,,,,,,,0,,,,,AB,terrains a bâtir,,,881,2.047044,46.082309
2020-269957,2020-08-27,000001,Vente,15000,,,AU BOURG,B358,23150,23001,Ahun,23,,,23001000AE0145,,,,,,,,,,,,,0,,,,,AB,terrains a bâtir,,,11,2.046843,46.082205
2020-270149,2020-09-07,000001,Vente,18000,32,,FELINAS,B372,23150,23001,Ahun,23,,,23001000ZH0137,,,,,,,,,,,,,0,1,Maison,40,1,P,prés,,,855,2.015509,46.099127
2020-270149,2020-09-07,000001,Vente,18000,32,,FELINAS,B372,23150,23001,Ahun,23,,,23001000ZH0137,,,,,,,,,,,,,0,1,Maison,40,1,S,sols,,,500,2.015509,46.099127
2020-270149,2020-09-07,000001,Vente,18000,,,FELINAS,B372,23150,23001,Ahun,23,,,23001000ZH0139,,,,,,,,,,,,,0,,,,,L,landes,,,50,2.015778,46.099237
2020-270149,2020-09-07,000001,Vente,18000,34,,FELINAS,B372,23150,23001,Ahun,23,,,23001000ZH0140,,,,,,,,,,,,,0,3,Dépendance,,0,S,sols,,,40,2.015835,46.099115
2020-270149,2020-09-07,000001,Vente,18000,,,FELINAS,B372,23150,23001,Ahun,23,,,23001000ZH0148,,,,,,,,,,,,,0,,,,,S,sols,,,145,2.01571,46.099223
2020-270154,2020-08-31,000001,Vente,95000,,,LAVAUD,B203,23150,23001,Ahun,23,,,23001000ZT0146,,,,,,,,,,,,,0,,,,,T,terres,,,2220,1.987749,46.086389
2020-270154,2020-08-31,000001,Vente,95000,,,LAVAUD,B203,23150,23001,Ahun,23,,,23001000ZT0149,,,,,,,,,,,,,0,,,,,J,jardins,,,110,1.988355,46.086196
2020-270154,2020-08-31,000001,Vente,95000,7,,LAVAUD,B203,23150,23001,Ahun,23,,,23001000ZT0150,,,,,,,,,,,,,0,1,Maison,119,3,J,jardins,,,2885,1.987939,46.085966
2020-270154,2020-08-31,000001,Vente,95000,7,,LAVAUD,B203,23150,23001,Ahun,23,,,23001000ZT0150,,,,,,,,,,,,,0,1,Maison,119,3,S,sols,,,500,1.987939,46.085966
2020-270154,2020-08-31,000001,Vente,95000,,,LAVAUD,B203,23150,23001,Ahun,23,,,23001000ZT0268,,,,,,,,,,,,,0,,,,,S,sols,,,220,1.988327,46.086155
2020-270795,2020-10-15,000001,Vente,15000,28,,RUE SAINT MICHEL,0420,23150,23001,Ahun,23,,,23001000AD0483,,,,,,,,,,,,,0,1,Maison,48,2,S,sols,,,41,2.045776,46.085257
2020-270796,2020-10-15,000001,Vente,22500,,,LE MAS ROZIER,B212,23150,23001,Ahun,23,,,230010000E0775,,,,,,,,,,,,,0,,,,,T,terres,,,1068,2.04368,46.081042
2020-270797,2020-10-15,000001,Vente,2000,10,,RUE FIACRE,0140,23150,23001,Ahun,23,,,23001000AD0270,,,,,,,,,,,,,0,1,Maison,66,3,S,sols,,,49,2.044316,46.086527
2020-271022,2020-11-20,000001,Vente,42000,,,AU BOURG,B358,23150,23001,Ahun,23,,,23001000AD0080,,,,,,,,,,,,,0,,,,,J,jardins,,,239,2.045382,46.087661
2020-271022,2020-11-20,000001,Vente,42000,4,,PL DE FUMADE,0170,23150,23001,Ahun,23,,,23001000AD0361,,,,,,,,,,,,,0,1,Maison,33,1,S,sols,,,542,2.04553,46.087626
2020-271022,2020-11-20,000001,Vente,42000,4,,PL DE FUMADE,0170,23150,23001,Ahun,23,,,23001000AD0361,,,,,,,,,,,,,0,1,Maison,122,6,S,sols,,,542,2.04553,46.087626
2020-271087,2020-12-01,000001,Vente,40000,,,LASCHAMP,B379,23150,23001,Ahun,23,,,23001000ZH0039,,,,,,,,,,,,,0,,,,,T,terres,,,6624,2.018831,46.099021
2020-271087,2020-12-01,000001,Vente,40000,,,LASCHAMP,B379,23150,23001,Ahun,23,,,23001000ZH0039,,,,,,,,,,,,,0,,,,,T,terres,,,13248,2.018831,46.099021
2020-271087,2020-12-01,000001,Vente,40000,,,LASCHAMP,B379,23150,23001,Ahun,23,,,23001000ZH0099,,,,,,,,,,,,,0,,,,,P,prés,,,5310,2.017623,46.098708
2020-271087,2020-12-01,000001,Vente,40000,,,LASCHAMP,B379,23150,23001,Ahun,23,,,23001000ZH0099,,,,,,,,,,,,,0,,,,,S,sols,,,100,2.017623,46.098708
2020-271087,2020-12-01,000001,Vente,40000,,,FELINAS,B372,23150,23001,Ahun,23,,,23001000ZH0104,,,,,,,,,,,,,0,,,,,T,terres,,,3680,2.017274,46.09901
2020-271087,2020-12-01,000001,Vente,40000,,,FELINAS,B372,23150,23001,Ahun,23,,,23001000ZH0104,,,,,,,,,,,,,0,,,,,S,sols,,,1500,2.017274,46.09901
2020-271087,2020-12-01,000001,Vente,40000,,,FELINAS,B372,23150,23001,Ahun,23,,,23001000ZH0107,,,,,,,,,,,,,0,,,,,T,terres,,,1030,2.01674,46.098948
2020-271191,2020-12-01,000001,Vente,40000,,,LASCHAMP,B379,23150,23001,Ahun,23,,,23001000ZH0039,,,,,,,,,,,,,0,,,,,T,terres,,,6624,2.018831,46.099021
2020-271191,2020-12-01,000001,Vente,40000,,,LASCHAMP,B379,23150,23001,Ahun,23,,,23001000ZH0039,,,,,,,,,,,,,0,,,,,T,terres,,,13248,2.018831,46.099021
2020-271191,2020-12-01,000001,Vente,40000,,,LASCHAMP,B379,23150,23001,Ahun,23,,,23001000ZH0099,,,,,,,,,,,,,0,,,,,P,prés,,,5310,2.017623,46.098708
2020-271191,2020-12-01,000001,Vente,40000,,,LASCHAMP,B379,23150,23001,Ahun,23,,,23001000ZH0099,,,,,,,,,,,,,0,,,,,S,sols,,,100,2.017623,46.098708
2020-271191,2020-12-01,000001,Vente,40000,,,FELINAS,B372,23150,23001,Ahun,23,,,23001000ZH0104,,,,,,,,,,,,,0,,,,,T,terres,,,3680,2.017274,46.09901
2020-271191,2020-12-01,000001,Vente,40000,,,FELINAS,B372,23150,23001,Ahun,23,,,23001000ZH0104,,,,,,,,,,,,,0,,,,,S,sols,,,1500,2.017274,46.09901
2020-271191,2020-12-01,000001,Vente,40000,,,FELINAS,B372,23150,23001,Ahun,23,,,23001000ZH0107,,,,,,,,,,,,,0,,,,,T,terres,,,1030,2.01674,46.098948
2020-271407,2020-12-17,000001,Vente,1500,,,LA CHAMP DE LA CASSIERE,B037,23150,23001,Ahun,23,,,230010000B0770,,,,,,,,,,,,,0,,,,,T,terres,,,2803,2.029818,46.086549
2020-271617,2020-12-21,000001,Vente,65000,15,,RUE DU DOCTEUR MAUMY,0270,23150,23001,Ahun,23,,,23001000AE0383,,,,,,,,,,,,,0,1,Maison,90,5,S,sols,,,1320,2.042013,46.083279
2020-271776,2020-12-01,000001,Vente,140000,,,LASCHAMP,B379,23150,23001,Ahun,23,,,23001000ZH0100,,,,,,,,,,,,,0,,,,,J,jardins,,,285,2.017399,46.098739
2020-271776,2020-12-01,000001,Vente,140000,,,LASCHAMP,B379,23150,23001,Ahun,23,,,23001000ZH0101,,,,,,,,,,,,,0,,,,,T,terres,,,800,2.017098,46.098375
2020-271776,2020-12-01,000001,Vente,140000,19,,FELINAS,B372,23150,23001,Ahun,23,,,23001000ZH0103,,,,,,,,,,,,,0,1,Maison,120,4,S,sols,,,390,2.017227,46.098739
2020-271776,2020-12-01,000001,Vente,140000,,,FELINAS,B372,23150,23001,Ahun,23,,,23001000ZH0158,,,,,,,,,,,,,0,,,,,S,sols,,,630,2.017244,46.098681
