id_mutation,date_mutation,numero_disposition,nature_mutation,valeur_fonciere,adresse_numero,adresse_suffixe,adresse_nom_voie,adresse_code_voie,code_postal,code_commune,nom_commune,code_departement,ancien_code_commune,ancien_nom_commune,id_parcelle,ancien_id_parcelle,numero_volume,lot1_numero,lot1_surface_carrez,lot2_numero,lot2_surface_carrez,lot3_numero,lot3_surface_carrez,lot4_numero,lot4_surface_carrez,lot5_numero,lot5_surface_carrez,nombre_lots,code_type_local,type_local,surface_reelle_bati,nombre_pieces_principales,code_nature_culture,nature_culture,code_nature_culture_speciale,nature_culture_speciale,surface_terrain,longitude,latitude
2020-267961,2020-01-28,000001,Vente,115000,,,LA COTERIE,B012,23140,23023,Blaudeix,23,,,230230000B0200,,,,,,,,,,,,,0,,,,,P,prés,,,1657,2.077723,46.229477
2020-267961,2020-01-28,000001,Vente,115000,,,LA COTERIE,B012,23140,23023,Blaudeix,23,,,230230000B0200,,,,,,,,,,,,,0,,,,,S,sols,,,100,2.077723,46.229477
2020-267961,2020-01-28,000001,Vente,115000,5073,,LA COTERIE,B012,23140,23023,Blaudeix,23,,,230230000B0203,,,,,,,,,,,,,0,1,Maison,120,6,S,sols,,,230,2.078035,46.229732
2020-267961,2020-01-28,000001,Vente,115000,,,LA COTERIE,B012,23140,23023,Blaudeix,23,,,230230000B0204,,,,,,,,,,,,,0,,,,,J,jardins,,,351,2.078125,46.229652
2020-267961,2020-01-28,000001,Vente,115000,5017,,LA COTERIE,B012,23140,23023,Blaudeix,23,,,230230000B0206,,,,,,,,,,,,,0,1,Maison,36,2,S,sols,,,160,2.078268,46.229721
2020-267961,2020-01-28,000001,Vente,115000,,,LA COTERIE,B012,23140,23023,Blaudeix,23,,,230230000B0215,,,,,,,,,,,,,0,,,,,S,sols,,,30,2.078375,46.230016
2020-267961,2020-01-28,000001,Vente,115000,,,LA COTERIE,B012,23140,23023,Blaudeix,23,,,230230000B0216,,,,,,,,,,,,,0,,,,,S,sols,,,107,2.078413,46.22997
2020-268080,2020-01-20,000001,Vente,25000,,,LA COTERIE,B012,23140,23023,Blaudeix,23,,,230230000B0232,,,,,,,,,,,,,0,,,,,S,sols,,,168,2.077198,46.231213
2020-268080,2020-01-20,000001,Vente,25000,5111,,LA COTERIE,B012,23140,23023,Blaudeix,23,,,230230000B0233,,,,,,,,,,,,,0,1,Maison,31,2,S,sols,,,200,2.077395,46.231257
2020-268080,2020-01-20,000001,Vente,25000,5111,,LA COTERIE,B012,23140,23023,Blaudeix,23,,,230230000B0233,,,,,,,,,,,,,0,1,Maison,31,2,P,prés,,,1084,2.077395,46.231257
2020-268958,2020-05-18,000001,Vente,200,,,LA COTERIE,B012,23140,23023,Blaudeix,23,,,230230000B0208,,,,,,,,,,,,,0,,,,,J,jardins,,,190,2.078319,46.229856
2020-269692,2020-07-20,000001,Vente,75000,,,BLAUDEIX,B001,23140,23023,Blaudeix,23,,,230230000A0227,,,,,,,,,,,,,0,,,,,T,terres,,,2632,2.085724,46.2317
2020-269692,2020-07-20,000001,Vente,75000,5022,,LE BOURG,B029,23140,23023,Blaudeix,23,,,230230000A0229,,,,,,,,,,,,,0,1,Maison,74,4,S,sols,,,785,2.085677,46.232189
2020-269692,2020-07-20,000001,Vente,75000,,,BLAUDEIX,B001,23140,23023,Blaudeix,23,,,230230000A0230,,,,,,,,,,,,,0,,,,,P,prés,,,1457,2.085878,46.232129
2020-269692,2020-07-20,000001,Vente,75000,,,BLAUDEIX,B001,23140,23023,Blaudeix,23,,,230230000A0943,,,,,,,,,,,,,0,,,,,P,prés,,,261,2.085542,46.232167
2020-269914,2020-07-29,000001,Vente,40500,,,LES COMBES,B009,23140,23023,Blaudeix,23,,,230230000A0125,,,,,,,,,,,,,0,,,,,BT,taillis simples,,,555,2.095397,46.243204
2020-269914,2020-07-29,000001,Vente,40500,,,LES COMBES,B009,23140,23023,Blaudeix,23,,,230230000A0126,,,,,,,,,,,,,0,,,,,BT,taillis simples,,,742,2.095496,46.243442
2020-269914,2020-07-29,000001,Vente,40500,,,LES COMBES,B009,23140,23023,Blaudeix,23,,,230230000A0127,,,,,,,,,,,,,0,,,,,P,prés,,,1472,2.094975,46.243436
2020-269914,2020-07-29,000001,Vente,40500,,,LES COMBES,B009,23140,23023,Blaudeix,23,,,230230000A0128,,,,,,,,,,,,,0,,,,,BT,taillis simples,,,747,2.095911,46.243525
2020-269914,2020-07-29,000001,Vente,40500,,,LES COMBES,B009,23140,23023,Blaudeix,23,,,230230000A0129,,,,,,,,,,,,,0,,,,,P,prés,,,1252,2.096094,46.243699
2020-269914,2020-07-29,000001,Vente,40500,,,LES COMBES,B009,23140,23023,Blaudeix,23,,,230230000A0137,,,,,,,,,,,,,0,,,,,T,terres,,,5763,2.097658,46.243319
2020-269914,2020-07-29,000001,Vente,40500,,,LES COMBES,B009,23140,23023,Blaudeix,23,,,230230000A0138,,,,,,,,,,,,,0,,,,,P,prés,,,5593,2.096419,46.242773
2020-269914,2020-07-29,000001,Vente,40500,,,LES COMBES,B009,23140,23023,Blaudeix,23,,,230230000A0139,,,,,,,,,,,,,0,,,,,T,terres,,,7461,2.097125,46.24251
2020-269914,2020-07-29,000001,Vente,40500,,,LES COMBES,B009,23140,23023,Blaudeix,23,,,230230000A0140,,,,,,,,,,,,,0,,,,,T,terres,,,3027,2.09615,46.243411
2020-269914,2020-07-29,000001,Vente,40500,,,LES COMBES,B009,23140,23023,Blaudeix,23,,,230230000A0141,,,,,,,,,,,,,0,,,,,T,terres,,,1649,2.095687,46.242937
2020-269914,2020-07-29,000001,Vente,40500,,,LES COMBES,B009,23140,23023,Blaudeix,23,,,230230000A0143,,,,,,,,,,,,,0,,,,,P,prés,,,5396,2.095907,46.242154
2020-269914,2020-07-29,000001,Vente,40500,,,LES COMBES,B009,23140,23023,Blaudeix,23,,,230230000A0146,,,,,,,,,,,,,0,,,,,T,terres,,,788,2.095381,46.241779
2020-269914,2020-07-29,000001,Vente,40500,5089,,BOURSONNEIX,B002,23140,23023,Blaudeix,23,,,230230000A0147,,,,,,,,,,,,,0,1,Maison,61,4,S,sols,,,756,2.095616,46.241703
