id_mutation,date_mutation,numero_disposition,nature_mutation,valeur_fonciere,adresse_numero,adresse_suffixe,adresse_nom_voie,adresse_code_voie,code_postal,code_commune,nom_commune,code_departement,ancien_code_commune,ancien_nom_commune,id_parcelle,ancien_id_parcelle,numero_volume,lot1_numero,lot1_surface_carrez,lot2_numero,lot2_surface_carrez,lot3_numero,lot3_surface_carrez,lot4_numero,lot4_surface_carrez,lot5_numero,lot5_surface_carrez,nombre_lots,code_type_local,type_local,surface_reelle_bati,nombre_pieces_principales,code_nature_culture,nature_culture,code_nature_culture_speciale,nature_culture_speciale,surface_terrain,longitude,latitude
2020-268170,2020-02-07,000001,Vente,1500,,,LA COMBE,B032,23500,23063,Clairavaux,23,,,23063000AK0025,,,,,,,,,,,,,0,,,,,T,terres,,,415,2.165309,45.775895
2020-268170,2020-02-07,000001,Vente,1500,,,LA COMBE,B032,23500,23063,Clairavaux,23,,,23063000AK0026,,,,,,,,,,,,,0,,,,,B,bois,,,3100,2.165654,45.775749
2020-268170,2020-02-07,000001,Vente,1500,,,LA COMBE,B032,23500,23063,Clairavaux,23,,,23063000AK0027,,,,,,,,,,,,,0,,,,,B,bois,,,5145,2.166549,45.775109
2020-268454,2020-02-26,000001,Vente,2600,,,LES COMBES DE L ARBRE,B034,23500,23063,Clairavaux,23,,,23063000AW0102,,,,,,,,,,,,,0,,,,,BR,futaies résineuses,,,28775,2.145057,45.786016
2020-269153,2020-06-10,000002,Vente,3000,,,LOUZELERGUE,B058,23500,23063,Clairavaux,23,,,23063000AL0202,,,,,,,,,,,,,0,,,,,S,sols,,,458,2.186821,45.758158
2020-269354,2020-07-08,000001,Vente,7000,16,,LES TROIS PONTS,B098,23500,23063,Clairavaux,23,,,23063000AH0103,,,,,,,,,,,,,0,1,Maison,25,2,P,prés,,,1981,2.167205,45.777875
2020-269354,2020-07-08,000001,Vente,7000,16,,LES TROIS PONTS,B098,23500,23063,Clairavaux,23,,,23063000AH0103,,,,,,,,,,,,,0,1,Maison,25,2,S,sols,,,369,2.167205,45.777875
2020-269354,2020-07-08,000001,Vente,7000,16,,LES TROIS PONTS,B098,23500,23063,Clairavaux,23,,,23063000AH0103,,,,,,,,,,,,,0,1,Maison,25,2,E,eaux,,,1225,2.167205,45.777875
2020-269944,2020-08-19,000001,Vente,145000,,,LE BOURG,B031,23500,23063,Clairavaux,23,,,23063000AI0102,,,,,,,,,,,,,0,,,,,S,sols,,,65,2.166869,45.781213
2020-269944,2020-08-19,000001,Vente,145000,,,LE BOURG,B031,23500,23063,Clairavaux,23,,,23063000AI0103,,,,,,,,,,,,,0,,,,,P,prés,,,3053,2.166529,45.781195
2020-269944,2020-08-19,000001,Vente,145000,,,LE BOURG,B031,23500,23063,Clairavaux,23,,,23063000AI0103,,,,,,,,,,,,,0,,,,,S,sols,,,497,2.166529,45.781195
2020-269944,2020-08-19,000001,Vente,145000,,,LE BOURG,B031,23500,23063,Clairavaux,23,,,23063000AI0104,,,,,,,,,,,,,0,,,,,J,jardins,,,575,2.166193,45.781459
2020-269944,2020-08-19,000001,Vente,145000,7,,LE BOURG,B031,23500,23063,Clairavaux,23,,,23063000AI0105,,,,,,,,,,,,,0,1,Maison,196,6,S,sols,,,631,2.166425,45.781501
2020-269944,2020-08-19,000001,Vente,145000,,,LE BOURG,B031,23500,23063,Clairavaux,23,,,23063000AI0110,,,,,,,,,,,,,0,,,,,S,sols,,,979,2.166036,45.781468
2020-269944,2020-08-19,000001,Vente,145000,,,LE BOURG,B031,23500,23063,Clairavaux,23,,,23063000AI0112,,,,,,,,,,,,,0,,,,,S,sols,,,501,2.165835,45.781236
2020-270216,2020-09-15,000001,Vente,101200,22,,LE BOURG,B031,23500,23063,Clairavaux,23,,,23063000AI0078,,,,,,,,,,,,,0,1,Maison,275,8,S,sols,,,351,2.166428,45.782658
2020-270216,2020-09-15,000001,Vente,101200,,,LE BOURG,B031,23500,23063,Clairavaux,23,,,23063000AI0123,,,,,,,,,,,,,0,,,,,J,jardins,,,329,2.166409,45.782769
2020-270237,2020-09-15,000001,Vente,25000,4,,LE BOURG,B031,23500,23063,Clairavaux,23,,,23063000AI0126,,,,,,,,,,,,,0,1,Maison,80,4,S,sols,,,510,2.166077,45.782562
2020-270237,2020-09-15,000001,Vente,25000,,,LE BOURG,B031,23500,23063,Clairavaux,23,,,23063000AI0127,,,,,,,,,,,,,0,,,,,L,landes,,,23,2.166198,45.782631
2020-270920,2020-11-18,000001,Vente,84500,46,,LE BOURG,B031,23500,23063,Clairavaux,23,,,23063000AZ0048,,,,,,,,,,,,,0,1,Maison,86,3,S,sols,,,600,2.169892,45.786241
2020-270920,2020-11-18,000001,Vente,84500,46,,LE BOURG,B031,23500,23063,Clairavaux,23,,,23063000AZ0048,,,,,,,,,,,,,0,1,Maison,86,3,T,terres,,,4144,2.169892,45.786241
2020-270920,2020-11-18,000001,Vente,84500,46,,LE BOURG,B031,23500,23063,Clairavaux,23,,,23063000AZ0048,,,,,,,,,,,,,0,1,Maison,86,3,T,terres,,,5726,2.169892,45.786241
2020-271187,2020-12-03,000001,Vente,1000,,,LE COUDERT,B038,23500,23063,Clairavaux,23,,,23063000AW0057,,,,,,,,,,,,,0,,,,,BR,futaies résineuses,,,2175,2.148737,45.788898
2020-271187,2020-12-03,000001,Vente,1000,,,LE COUDERT,B038,23500,23063,Clairavaux,23,,,23063000AW0058,,,,,,,,,,,,,0,,,,,PC,pacages,,,2640,2.14837,45.789282
