id_mutation,date_mutation,numero_disposition,nature_mutation,valeur_fonciere,adresse_numero,adresse_suffixe,adresse_nom_voie,adresse_code_voie,code_postal,code_commune,nom_commune,code_departement,ancien_code_commune,ancien_nom_commune,id_parcelle,ancien_id_parcelle,numero_volume,lot1_numero,lot1_surface_carrez,lot2_numero,lot2_surface_carrez,lot3_numero,lot3_surface_carrez,lot4_numero,lot4_surface_carrez,lot5_numero,lot5_surface_carrez,nombre_lots,code_type_local,type_local,surface_reelle_bati,nombre_pieces_principales,code_nature_culture,nature_culture,code_nature_culture_speciale,nature_culture_speciale,surface_terrain,longitude,latitude
2020-276078,2020-11-13,000001,Vente,3500,,,LE BRANDEAU SUD,B006,24610,24083,Carsac-de-Gurson,24,,,240830000B0589,,,,,,,,,,,,,0,,,,,BT,taillis simples,,,16935,0.113976,44.927576
2020-276078,2020-11-13,000001,Vente,3500,,,LE BRANDEAU SUD,B006,24610,24083,Carsac-de-Gurson,24,,,240830000B0591,,,,,,,,,,,,,0,,,,,BT,taillis simples,,,1220,0.112701,44.927464
2020-276923,2020-11-30,000001,Vente,245000,,,GURSON,B013,24610,24083,Carsac-de-Gurson,24,,,240830000A1244,,,,,,,,,,,,,0,,,,,T,terres,,,635,0.089271,44.944867
2020-276923,2020-11-30,000001,Vente,245000,,,GURSON,B013,24610,24083,Carsac-de-Gurson,24,,,240830000A1244,,,,,,,,,,,,,0,,,,,S,sols,,,500,0.089271,44.944867
2020-276923,2020-11-30,000001,Vente,245000,41,A,GURSON,B013,24610,24083,Carsac-de-Gurson,24,,,240830000A1246,,,,,,,,,,,,,0,1,Maison,250,9,T,terres,,,3240,0.089882,44.944677
2020-276923,2020-11-30,000001,Vente,245000,41,A,GURSON,B013,24610,24083,Carsac-de-Gurson,24,,,240830000A1246,,,,,,,,,,,,,0,1,Maison,250,9,S,sols,,,800,0.089882,44.944677
2020-277499,2020-12-11,000001,Vente,28000,,,GURSON,B013,24610,24083,Carsac-de-Gurson,24,,,240830000A1268,,,,,,,,,,,,,0,,,,,P,prés,,,3056,0.078825,44.939804
2020-277575,2020-11-24,000001,Vente,500,,,LES BOURNETTES,B004,24610,24083,Carsac-de-Gurson,24,,,240830000A0191,,,,,,,,,,,,,0,,,,,P,prés,,,1790,0.082414,44.952533
2020-277575,2020-11-24,000001,Vente,500,,,LES BOURNETTES,B004,24610,24083,Carsac-de-Gurson,24,,,240830000A0192,,,,,,,,,,,,,0,,,,,P,prés,,,1370,0.082673,44.95244
2020-277575,2020-11-24,000001,Vente,500,,,LES BOURNETTES,B004,24610,24083,Carsac-de-Gurson,24,,,240830000A0195,,,,,,,,,,,,,0,,,,,P,prés,,,1810,0.08277,44.952275
2020-277575,2020-11-24,000001,Vente,500,,,LES BOURNETTES,B004,24610,24083,Carsac-de-Gurson,24,,,240830000A0197,,,,,,,,,,,,,0,,,,,P,prés,,,1220,0.082735,44.952082
2020-277575,2020-11-24,000001,Vente,500,,,LES BOURNETTES,B004,24610,24083,Carsac-de-Gurson,24,,,240830000A0198,,,,,,,,,,,,,0,,,,,P,prés,,,650,0.082476,44.951967
2020-277575,2020-11-24,000001,Vente,500,,,LES BOURNETTES,B004,24610,24083,Carsac-de-Gurson,24,,,240830000A0199,,,,,,,,,,,,,0,,,,,P,prés,,,725,0.082036,44.951769
2020-277575,2020-11-24,000001,Vente,500,,,LES BOURNETTES,B004,24610,24083,Carsac-de-Gurson,24,,,240830000A0200,,,,,,,,,,,,,0,,,,,P,prés,,,1425,0.081998,44.951457
2020-277575,2020-11-24,000001,Vente,500,,,LES BOURNETTES,B004,24610,24083,Carsac-de-Gurson,24,,,240830000A0207,,,,,,,,,,,,,0,,,,,T,terres,,,465,0.08312,44.951017
2020-278587,2020-01-27,000001,Vente,22500,,,GURSON,B013,24610,24083,Carsac-de-Gurson,24,,,240830000A1302,,,,,,,,,,,,,0,,,,,T,terres,,,3288,0.081932,44.943618
2020-278615,2020-01-23,000001,Vente,38000,,,LE BOURG NORD,B002,24610,24083,Carsac-de-Gurson,24,,,240830000A0440,,,,,,,,,,,,,0,,,,,S,sols,,,50,0.090397,44.947103
2020-278615,2020-01-23,000001,Vente,38000,26,,LE BOURG NORD,B002,24610,24083,Carsac-de-Gurson,24,,,240830000A0441,,,,,,,,,,,,,0,1,Maison,50,3,S,sols,,,135,0.090416,44.947027
2020-278615,2020-01-23,000001,Vente,38000,,,LE BOURG NORD,B002,24610,24083,Carsac-de-Gurson,24,,,240830000A0453,,,,,,,,,,,,,0,,,,,J,jardins,,,410,0.088301,44.946455
2020-278615,2020-01-23,000001,Vente,38000,,,GURSON,B013,24610,24083,Carsac-de-Gurson,24,,,240830000A0590,,,,,,,,,,,,,0,,,,,J,jardins,,,490,0.088436,44.94616
2020-278615,2020-01-23,000001,Vente,38000,,,LE BOURG NORD,B002,24610,24083,Carsac-de-Gurson,24,,,240830000A0870,,,,,,,,,,,,,0,,,,,S,sols,,,35,0.090452,44.94698
2020-278775,2020-03-04,000002,Vente,14664,9000,,LA LIDOIRE,B014,24610,24083,Carsac-de-Gurson,24,,,240830000B1139,,,,,,,,,,,,,0,4,Local industriel. commercial ou assimilé,,0,,,,,,0.123738,44.932002
2020-279079,2020-04-09,000001,Vente,75000,52,,LES MILLAUDES,B016,24610,24083,Carsac-de-Gurson,24,,,240830000A1194,,,,,,,,,,,,,0,1,Maison,126,5,S,sols,,,263,0.085736,44.933406
2020-279079,2020-04-09,000001,Vente,75000,52,,LES MILLAUDES,B016,24610,24083,Carsac-de-Gurson,24,,,240830000A1194,,,,,,,,,,,,,0,1,Maison,86,4,S,sols,,,263,0.085736,44.933406
2020-279079,2020-04-09,000001,Vente,75000,52,,LES MILLAUDES,B016,24610,24083,Carsac-de-Gurson,24,,,240830000A1194,,,,,,,,,,,,,0,1,Maison,86,4,P,prés,,,4443,0.085736,44.933406
2020-279079,2020-04-09,000001,Vente,75000,52,,LES MILLAUDES,B016,24610,24083,Carsac-de-Gurson,24,,,240830000A1194,,,,,,,,,,,,,0,1,Maison,126,5,P,prés,,,4443,0.085736,44.933406
2020-279079,2020-04-09,000001,Vente,75000,,,LES MILLAUDES,B016,24610,24083,Carsac-de-Gurson,24,,,240830000A1242,,,,,,,,,,,,,0,,,,,S,sols,,,115,0.085729,44.933402
2020-279438,2020-06-19,000001,Vente,230000,,,LE BRANDEAU NORD,B005,24610,24083,Carsac-de-Gurson,24,,,240830000B0419,,,,,,,,,,,,,0,,,,,S,sols,,,755,0.113218,44.934184
2020-279438,2020-06-19,000001,Vente,230000,,,LE BRANDEAU SUD,B006,24610,24083,Carsac-de-Gurson,24,,,240830000B0535,,,,,,,,,,,,,0,,,,,T,terres,,,3485,0.112931,44.933563
2020-279438,2020-06-19,000001,Vente,230000,,,LE BRANDEAU SUD,B006,24610,24083,Carsac-de-Gurson,24,,,240830000B0536,,,,,,,,,,,,,0,,,,,T,terres,,,815,0.112729,44.932863
2020-279438,2020-06-19,000001,Vente,230000,,,LE BRANDEAU SUD,B006,24610,24083,Carsac-de-Gurson,24,,,240830000B0537,,,,,,,,,,,,,0,,,,,T,terres,,,3135,0.11366,44.933339
2020-279438,2020-06-19,000001,Vente,230000,77,,LE BRANDEAU SUD,B006,24610,24083,Carsac-de-Gurson,24,,,240830000B0538,,,,,,,,,,,,,0,1,Maison,120,5,S,sols,,,435,0.113288,44.93384
2020-279438,2020-06-19,000001,Vente,230000,,,LE BRANDEAU SUD,B006,24610,24083,Carsac-de-Gurson,24,,,240830000B0540,,,,,,,,,,,,,0,,,,,T,terres,,,1955,0.114314,44.932262
2020-279438,2020-06-19,000001,Vente,230000,,,LE BRANDEAU SUD,B006,24610,24083,Carsac-de-Gurson,24,,,240830000B0867,,,,,,,,,,,,,0,,,,,T,terres,,,1150,0.113912,44.933224
2020-279438,2020-06-19,000001,Vente,230000,,,LE BRANDEAU SUD,B006,24610,24083,Carsac-de-Gurson,24,,,240830000B0920,,,,,,,,,,,,,0,,,,,P,prés,,,10890,0.113372,44.93281
