id_mutation,date_mutation,numero_disposition,nature_mutation,valeur_fonciere,adresse_numero,adresse_suffixe,adresse_nom_voie,adresse_code_voie,code_postal,code_commune,nom_commune,code_departement,ancien_code_commune,ancien_nom_commune,id_parcelle,ancien_id_parcelle,numero_volume,lot1_numero,lot1_surface_carrez,lot2_numero,lot2_surface_carrez,lot3_numero,lot3_surface_carrez,lot4_numero,lot4_surface_carrez,lot5_numero,lot5_surface_carrez,nombre_lots,code_type_local,type_local,surface_reelle_bati,nombre_pieces_principales,code_nature_culture,nature_culture,code_nature_culture_speciale,nature_culture_speciale,surface_terrain,longitude,latitude
2020-275945,2020-11-10,000001,Vente,612600,,,LE CASTANET,B019,24290,24106,La Chapelle-Aubareil,24,,,24106000AC0019,,,,,,,,,,,,,0,,,,,BS,taillis sous futaie,,,800,1.182219,45.032664
2020-275945,2020-11-10,000001,Vente,612600,,,LE CASTANET,B019,24290,24106,La Chapelle-Aubareil,24,,,24106000AC0020,,,,,,,,,,,,,0,,,,,P,prés,,,5710,1.180946,45.032286
2020-275945,2020-11-10,000001,Vente,612600,,,LE CASTANET,B019,24290,24106,La Chapelle-Aubareil,24,,,24106000AC0021,,,,,,,,,,,,,0,,,,,T,terres,,,3310,1.180954,45.032704
2020-275945,2020-11-10,000001,Vente,612600,,,LE CASTANET,B019,24290,24106,La Chapelle-Aubareil,24,,,24106000AC0022,,,,,,,,,,,,,0,,,,,BS,taillis sous futaie,,,12930,1.180975,45.032925
2020-275945,2020-11-10,000001,Vente,612600,,,LE CASTANET,B019,24290,24106,La Chapelle-Aubareil,24,,,24106000AC0024,,,,,,,,,,,,,0,,,,,P,prés,,,1807,1.179364,45.033436
2020-275945,2020-11-10,000001,Vente,612600,,,LE CASTANET,B019,24290,24106,La Chapelle-Aubareil,24,,,24106000AC0025,,,,,,,,,,,,,0,,,,,P,prés,,,561,1.179415,45.033708
2020-275945,2020-11-10,000001,Vente,612600,,,LE CASTANET,B019,24290,24106,La Chapelle-Aubareil,24,,,24106000AC0031,,,,,,,,,,,,,0,,,,,P,prés,,,1282,1.1789,45.033248
2020-275945,2020-11-10,000001,Vente,612600,,,LE CASTANET,B019,24290,24106,La Chapelle-Aubareil,24,,,24106000AC0032,,,,,,,,,,,,,0,,,,,BT,taillis simples,,,5670,1.179128,45.03289
2020-275945,2020-11-10,000001,Vente,612600,,,LE CASTANET,B019,24290,24106,La Chapelle-Aubareil,24,,,24106000AC0033,,,,,,,,,,,,,0,,,,,P,prés,,,3320,1.179398,45.032263
2020-275945,2020-11-10,000001,Vente,612600,,,LE CASTANET,B019,24290,24106,La Chapelle-Aubareil,24,,,24106000AC0034,,,,,,,,,,,,,0,,,,,BT,taillis simples,,,3000,1.178568,45.032388
2020-275945,2020-11-10,000001,Vente,612600,,,LE CASTANET,B019,24290,24106,La Chapelle-Aubareil,24,,,24106000AC0035,,,,,,,,,,,,,0,,,,,P,prés,,,1312,1.1787,45.032231
2020-275945,2020-11-10,000001,Vente,612600,,,LE CASTANET,B019,24290,24106,La Chapelle-Aubareil,24,,,24106000AC0048,,,,,,,,,,,,,0,,,,,P,prés,,,3100,1.175297,45.030716
2020-275945,2020-11-10,000001,Vente,612600,,,LE CASTANET,B019,24290,24106,La Chapelle-Aubareil,24,,,24106000AC0051,,,,,,,,,,,,,0,,,,,BT,taillis simples,,,2750,1.176846,45.030445
2020-275945,2020-11-10,000001,Vente,612600,,,LE CASTANET,B019,24290,24106,La Chapelle-Aubareil,24,,,24106000AC0052,,,,,,,,,,,,,0,,,,,P,prés,,,6090,1.176889,45.030858
2020-275945,2020-11-10,000001,Vente,612600,,,LE CASTANET,B019,24290,24106,La Chapelle-Aubareil,24,,,24106000AC0053,,,,,,,,,,,,,0,,,,,BT,taillis simples,,,2840,1.17739,45.031248
2020-275945,2020-11-10,000001,Vente,612600,,,LE CASTANET,B019,24290,24106,La Chapelle-Aubareil,24,,,24106000AC0054,,,,,,,,,,,,,0,,,,,BS,taillis sous futaie,,,2496,1.177965,45.031134
2020-275945,2020-11-10,000001,Vente,612600,,,LE CASTANET,B019,24290,24106,La Chapelle-Aubareil,24,,,24106000AC0056,,,,,,,,,,,,,0,,,,,BS,taillis sous futaie,,,1980,1.178134,45.031731
2020-275945,2020-11-10,000001,Vente,612600,,,LE CASTANET,B019,24290,24106,La Chapelle-Aubareil,24,,,24106000AC0058,,,,,,,,,,,,,0,,,,,P,prés,,,1062,1.179539,45.031794
2020-275945,2020-11-10,000001,Vente,612600,,,LE CASTANET,B019,24290,24106,La Chapelle-Aubareil,24,,,24106000AC0059,,,,,,,,,,,,,0,,,,,P,prés,,,415,1.179742,45.032006
2020-275945,2020-11-10,000001,Vente,612600,,,LE CASTANET,B019,24290,24106,La Chapelle-Aubareil,24,,,24106000AC0060,,,,,,,,,,,,,0,,,,,P,prés,,,573,1.180126,45.032127
2020-275945,2020-11-10,000001,Vente,612600,105,,IMP DU TILLEUL,0735,24290,24106,La Chapelle-Aubareil,24,,,24106000AC0061,,,,,,,,,,,,,0,1,Maison,293,8,S,sols,,,1150,1.180027,45.031849
2020-275945,2020-11-10,000001,Vente,612600,8,C,LE CASTANET,B019,24290,24106,La Chapelle-Aubareil,24,,,24106000AC0063,,,,,,,,,,,,,0,3,Dépendance,,0,P,prés,,,2833,1.180536,45.031885
2020-275945,2020-11-10,000001,Vente,612600,8,C,LE CASTANET,B019,24290,24106,La Chapelle-Aubareil,24,,,24106000AC0063,,,,,,,,,,,,,0,3,Dépendance,,0,S,sols,,,687,1.180536,45.031885
2020-275945,2020-11-10,000001,Vente,612600,,,LE CASTANET,B019,24290,24106,La Chapelle-Aubareil,24,,,24106000AC0075,,,,,,,,,,,,,0,,,,,BS,taillis sous futaie,,,4880,1.179037,45.030686
2020-275945,2020-11-10,000001,Vente,612600,,,LE CASTANET,B019,24290,24106,La Chapelle-Aubareil,24,,,24106000AC0078,,,,,,,,,,,,,0,,,,,BT,taillis simples,,,1251,1.178995,45.031217
2020-275945,2020-11-10,000001,Vente,612600,,,LE CASTANET,B019,24290,24106,La Chapelle-Aubareil,24,,,24106000AC0079,,,,,,,,,,,,,0,,,,,BT,taillis simples,,,751,1.178505,45.030739
2020-275945,2020-11-10,000001,Vente,612600,,,LE CASTANET,B019,24290,24106,La Chapelle-Aubareil,24,,,24106000AC0080,,,,,,,,,,,,,0,,,,,P,prés,,,12920,1.178158,45.030092
2020-275945,2020-11-10,000001,Vente,612600,,,LA GENIEVRE,B041,24290,24106,La Chapelle-Aubareil,24,,,24106000AC0411,,,,,,,,,,,,,0,,,,,P,prés,,,761,1.174162,45.030574
2020-275945,2020-11-10,000001,Vente,612600,,,LA GENIEVRE,B041,24290,24106,La Chapelle-Aubareil,24,,,24106000AC0413,,,,,,,,,,,,,0,,,,,P,prés,,,4990,1.174247,45.030017
2020-275945,2020-11-10,000001,Vente,612600,,,LE CASTANET,B019,24290,24106,La Chapelle-Aubareil,24,,,24106000AC0436,,,,,,,,,,,,,0,,,,,P,prés,,,930,1.181608,45.032742
2020-275945,2020-11-10,000001,Vente,612600,,,LE CASTANET,B019,24290,24106,La Chapelle-Aubareil,24,,,24106000AC0438,,,,,,,,,,,,,0,,,,,S,sols,,,77,1.179765,45.03171
2020-275945,2020-11-10,000001,Vente,612600,,,LE CASTANET,B019,24290,24106,La Chapelle-Aubareil,24,,,24106000AC0479,,,,,,,,,,,,,0,,,,,BT,taillis simples,,,244,1.178768,45.031884
2020-275945,2020-11-10,000001,Vente,612600,,,LE CASTANET,B019,24290,24106,La Chapelle-Aubareil,24,,,24106000AC0481,,,,,,,,,,,,,0,,,,,BT,taillis simples,,,790,1.179034,45.031946
2020-275945,2020-11-10,000001,Vente,612600,,,LE CASTANET,B019,24290,24106,La Chapelle-Aubareil,24,,,24106000AC0482,,,,,,,,,,,,,0,,,,,P,prés,,,380,1.179245,45.03168
2020-275945,2020-11-10,000001,Vente,612600,,,LE CASTANET,B019,24290,24106,La Chapelle-Aubareil,24,,,24106000AC0484,,,,,,,,,,,,,0,,,,,P,prés,,,5490,1.178665,45.03141
2020-275945,2020-11-10,000001,Vente,612600,,,LE CASTANET,B019,24290,24106,La Chapelle-Aubareil,24,,,24106000AC0485,,,,,,,,,,,,,0,,,,,L,landes,,,62,1.179414,45.031396
2020-275945,2020-11-10,000001,Vente,612600,,,LE CASTANET,B019,24290,24106,La Chapelle-Aubareil,24,,,24106000AC0487,,,,,,,,,,,,,0,,,,,L,landes,,,519,1.179472,45.031523
2020-275945,2020-11-10,000001,Vente,612600,,,LE CASTANET,B019,24290,24106,La Chapelle-Aubareil,24,,,24106000AC0488,,,,,,,,,,,,,0,,,,,L,landes,,,350,1.179751,45.031727
2020-275945,2020-11-10,000001,Vente,612600,,,LE CASTANET,B019,24290,24106,La Chapelle-Aubareil,24,,,24106000AC0513,,,,,,,,,,,,,0,,,,,S,sols,,,34,1.179994,45.03165
2020-277616,2020-12-29,000001,Vente,306150,779,,CHE DES CRETES,0185,24290,24106,La Chapelle-Aubareil,24,,,24106000AC0454,,,,,,,,,,,,,0,1,Maison,120,4,BT,taillis simples,,,53363,1.173631,45.032625
2020-277616,2020-12-29,000001,Vente,306150,779,,CHE DES CRETES,0185,24290,24106,La Chapelle-Aubareil,24,,,24106000AC0454,,,,,,,,,,,,,0,3,Dépendance,,0,BT,taillis simples,,,53363,1.173631,45.032625
2020-277616,2020-12-29,000001,Vente,306150,779,,CHE DES CRETES,0185,24290,24106,La Chapelle-Aubareil,24,,,24106000AC0454,,,,,,,,,,,,,0,1,Maison,120,4,S,sols,,,1000,1.173631,45.032625
2020-277616,2020-12-29,000001,Vente,306150,779,,CHE DES CRETES,0185,24290,24106,La Chapelle-Aubareil,24,,,24106000AC0454,,,,,,,,,,,,,0,3,Dépendance,,0,S,sols,,,1000,1.173631,45.032625
2020-277616,2020-12-29,000001,Vente,306150,,,LE POZADOU,B070,24290,24106,La Chapelle-Aubareil,24,,,24106000AC0458,,,,,,,,,,,,,0,,,,,BT,taillis simples,,,2733,1.174301,45.033993
2020-277767,2020-12-22,000001,Vente,204000,295,,LA BEUNE HAUTE,B008,24290,24106,La Chapelle-Aubareil,24,,,24106000AS0295,,,,,,,,,,,,,0,1,Maison,89,4,T,terres,,,2533,1.198647,44.986526
2020-282057,2020-01-27,000001,Vente,30000,,,FOUGERAS,B039,24290,24106,La Chapelle-Aubareil,24,,,24106000AC0291,,,,,,,,,,,,,0,,,,,BT,taillis simples,,,1833,1.185937,45.024497
2020-282057,2020-01-27,000001,Vente,30000,,,FOUGERAS,B039,24290,24106,La Chapelle-Aubareil,24,,,24106000AC0292,,,,,,,,,,,,,0,,,,,BS,taillis sous futaie,,,4530,1.185433,45.025005
2020-282057,2020-01-27,000001,Vente,30000,,,FOUGERAS,B039,24290,24106,La Chapelle-Aubareil,24,,,24106000AC0293,,,,,,,,,,,,,0,,,,,P,prés,,,380,1.185931,45.02476
2020-282057,2020-01-27,000001,Vente,30000,,,FOUGERAS,B039,24290,24106,La Chapelle-Aubareil,24,,,24106000AC0295,,,,,,,,,,,,,0,,,,,T,terres,,,1395,1.186176,45.024755
2020-282057,2020-01-27,000001,Vente,30000,453,,FOUGERAS,B039,24290,24106,La Chapelle-Aubareil,24,,,24106000AC0453,,,,,,,,,,,,,0,4,Local industriel. commercial ou assimilé,446,0,S,sols,,,1615,1.186421,45.024173
2020-282057,2020-01-27,000001,Vente,30000,,,FOUGERAS,B039,24290,24106,La Chapelle-Aubareil,24,,,24106000AC0508,,,,,,,,,,,,,0,,,,,S,sols,,,487,1.186511,45.023781
2020-282074,2020-01-30,000001,Vente,152900,463,,CHE DE L AIR,0010,24290,24106,La Chapelle-Aubareil,24,,,24106000AL0484,,,,,,,,,,,,,0,1,Maison,39,1,P,prés,,,2380,1.175792,45.020174
2020-282074,2020-01-30,000001,Vente,152900,463,,CHE DE L AIR,0010,24290,24106,La Chapelle-Aubareil,24,,,24106000AL0484,,,,,,,,,,,,,0,1,Maison,39,1,S,sols,,,500,1.175792,45.020174
2020-282074,2020-01-30,000001,Vente,152900,463,,CHE DE L AIR,0010,24290,24106,La Chapelle-Aubareil,24,,,24106000AL0484,,,,,,,,,,,,,0,1,Maison,101,3,P,prés,,,2380,1.175792,45.020174
2020-282074,2020-01-30,000001,Vente,152900,463,,CHE DE L AIR,0010,24290,24106,La Chapelle-Aubareil,24,,,24106000AL0484,,,,,,,,,,,,,0,1,Maison,101,3,S,sols,,,500,1.175792,45.020174
2020-282093,2020-01-11,000001,Vente,30000,,,FOUGERAS,B039,24290,24106,La Chapelle-Aubareil,24,,,24106000AC0266,,,,,,,,,,,,,0,,,,,L,landes,,,547,1.188721,45.022112
2020-282093,2020-01-11,000001,Vente,30000,,,FOUGERAS,B039,24290,24106,La Chapelle-Aubareil,24,,,24106000AC0267,,,,,,,,,,,,,0,,,,,T,terres,,,2545,1.188307,45.021966
2020-282136,2020-02-11,000001,Vente,131100,23,,IMP DE LA SAGNE NORD,0632,24290,24106,La Chapelle-Aubareil,24,,,24106000AC0243,,,,,,,,,,,,,0,1,Maison,119,4,S,sols,,,290,1.188534,45.028203
2020-282136,2020-02-11,000001,Vente,131100,23,,IMP DE LA SAGNE NORD,0632,24290,24106,La Chapelle-Aubareil,24,,,24106000AC0243,,,,,,,,,,,,,0,3,Dépendance,,0,S,sols,,,290,1.188534,45.028203
2020-282136,2020-02-11,000001,Vente,131100,,,LA SAGNE,B078,24290,24106,La Chapelle-Aubareil,24,,,24106000AC0511,,,,,,,,,,,,,0,,,,,S,sols,,,79,1.188453,45.028264
2020-282313,2020-03-09,000001,Vente,40000,,,LA BEUNE HAUTE,B008,24290,24106,La Chapelle-Aubareil,24,,,24106000AS0038,,,,,,,,,,,,,0,,,,,T,terres,,,10965,1.198879,44.987662
2020-282313,2020-03-09,000001,Vente,40000,,,LA BEUNE HAUTE,B008,24290,24106,La Chapelle-Aubareil,24,,,24106000AS0039,,,,,,,,,,,,,0,,,,,S,sols,,,12,1.198366,44.987401
2020-282458,2020-04-01,000001,Vente,39990,,,LAFAGE,B049,24290,24106,La Chapelle-Aubareil,24,,,24106000AL0573,,,,,,,,,,,,,0,,,,,AB,terrains a bâtir,,,2368,1.191089,45.015171
2020-282458,2020-04-01,000001,Vente,39990,,,LAFAGE,B049,24290,24106,La Chapelle-Aubareil,24,,,24106000AL0575,,,,,,,,,,,,,0,,,,,L,landes,,,405,1.191087,45.014874
2020-282694,2020-05-15,000001,Vente,30000,,,LES GRANGES,B045,24290,24106,La Chapelle-Aubareil,24,,,24106000AL0586,,,,,,,,,,,,,0,,,,,T,terres,,,512,1.178748,45.011743
2020-282694,2020-05-15,000001,Vente,30000,,,LES GRANGES,B045,24290,24106,La Chapelle-Aubareil,24,,,24106000AL0588,,,,,,,,,,,,,0,,,,,T,terres,,,489,1.178997,45.011976
2020-282694,2020-05-15,000001,Vente,30000,,,LES GRANGES,B045,24290,24106,La Chapelle-Aubareil,24,,,24106000AL0591,,,,,,,,,,,,,0,,,,,T,terres,,,92,1.179118,45.011876
2020-282694,2020-05-15,000001,Vente,30000,,,LES GRANGES,B045,24290,24106,La Chapelle-Aubareil,24,,,24106000AL0593,,,,,,,,,,,,,0,,,,,T,terres,,,806,1.178598,45.011822
2020-282706,2020-05-13,000001,Vente,41500,,,LA RENARDERIE,B071,24290,24106,La Chapelle-Aubareil,24,,,24106000AI0430,,,,,,,,,,,,,0,,,,,S,sols,,,35,1.190084,45.013405
2020-282706,2020-05-13,000001,Vente,41500,,,LA RENARDERIE,B071,24290,24106,La Chapelle-Aubareil,24,,,24106000AI0434,,,,,,,,,,,,,0,,,,,T,terres,,,40,1.190029,45.013505
2020-282706,2020-05-13,000001,Vente,41500,,,LA RENARDERIE,B071,24290,24106,La Chapelle-Aubareil,24,,,24106000AI0436,,,,,,,,,,,,,0,,,,,T,terres,,,2653,1.190568,45.012989
2020-282812,2020-06-19,000002,Vente,47000,,,LA BEUNE HAUTE,B008,24290,24106,La Chapelle-Aubareil,24,,,24106000AS0314,,,,,,,,,,,,,0,,,,,T,terres,,,7997,1.199422,44.986721
2020-282995,2020-07-21,000001,Vente,79710,,,LAJAS,B050,24290,24106,La Chapelle-Aubareil,24,,,24106000AN0159,,,,,,,,,,,,,0,,,,,P,prés,,,720,1.176302,45.008648
2020-282995,2020-07-21,000001,Vente,79710,,,LAJAS,B050,24290,24106,La Chapelle-Aubareil,24,,,24106000AN0159,,,,,,,,,,,,,0,,,,,S,sols,,,880,1.176302,45.008648
2020-282995,2020-07-21,000001,Vente,79710,17,A,LAJAS,B050,24290,24106,La Chapelle-Aubareil,24,,,24106000AN0160,,,,,,,,,,,,,0,1,Maison,77,4,P,prés,,,1370,1.176515,45.008372
2020-283078,2020-07-16,000001,Vente,40000,,,LA BEUNE HAUTE,B008,24290,24106,La Chapelle-Aubareil,24,,,24106000AS0050,,,,,,,,,,,,,0,,,,,P,prés,,,12190,1.198793,44.98863
2020-283078,2020-07-16,000001,Vente,40000,,,LA BEUNE HAUTE,B008,24290,24106,La Chapelle-Aubareil,24,,,24106000AS0051,,,,,,,,,,,,,0,,,,,T,terres,,,3580,1.198628,44.989111
2020-283082,2020-07-17,000001,Vente,328000,,,FOUGERAS,B039,24290,24106,La Chapelle-Aubareil,24,,,24106000AC0271,,,,,,,,,,,,,0,,,,,BT,taillis simples,,,483,1.187097,45.02307
2020-283082,2020-07-17,000001,Vente,328000,,,FOUGERAS,B039,24290,24106,La Chapelle-Aubareil,24,,,24106000AC0286,,,,,,,,,,,,,0,,,,,S,sols,,,200,1.185913,45.023201
2020-283082,2020-07-17,000001,Vente,328000,,,FOUGERAS,B039,24290,24106,La Chapelle-Aubareil,24,,,24106000AC0286,,,,,,,,,,,,,0,,,,,BT,taillis simples,,,4770,1.185913,45.023201
2020-283082,2020-07-17,000001,Vente,328000,347,,RTE DE FOUGERAS,0295,24290,24106,La Chapelle-Aubareil,24,,,24106000AC0509,,,,,,,,,,,,,0,1,Maison,161,7,T,terres,,,5758,1.186708,45.023377
2020-283082,2020-07-17,000001,Vente,328000,347,,RTE DE FOUGERAS,0295,24290,24106,La Chapelle-Aubareil,24,,,24106000AC0509,,,,,,,,,,,,,0,1,Maison,161,7,S,sols,,,500,1.186708,45.023377
2020-283202,2020-07-30,000001,Vente,132000,29,,RUE DE L ECOLE,0220,24290,24106,La Chapelle-Aubareil,24,,,24106000AL0155,,,,,,,,,,,,,0,1,Maison,106,6,S,sols,,,79,1.182652,45.013138
2020-283731,2020-10-23,000001,Vente,1000,,,LA FORET,B038,24290,24106,La Chapelle-Aubareil,24,,,24106000AO0174,,,,,,,,,,,,,0,,,,,L,landes,,,1692,1.190567,44.999727
