id_mutation,date_mutation,numero_disposition,nature_mutation,valeur_fonciere,adresse_numero,adresse_suffixe,adresse_nom_voie,adresse_code_voie,code_postal,code_commune,nom_commune,code_departement,ancien_code_commune,ancien_nom_commune,id_parcelle,ancien_id_parcelle,numero_volume,lot1_numero,lot1_surface_carrez,lot2_numero,lot2_surface_carrez,lot3_numero,lot3_surface_carrez,lot4_numero,lot4_surface_carrez,lot5_numero,lot5_surface_carrez,nombre_lots,code_type_local,type_local,surface_reelle_bati,nombre_pieces_principales,code_nature_culture,nature_culture,code_nature_culture_speciale,nature_culture_speciale,surface_terrain,longitude,latitude
2020-277575,2020-11-24,000001,Vente,500,,,LE TERME DEL PEYS,B134,24560,24168,Plaisance,24,,,241682500A0535,,,,,,,,,,,,,0,,,,,L,landes,,,3638,0.549119,44.724142
2020-277871,2020-12-28,000001,Vente,312500,,,GROS BUISSON,B068,24560,24168,Plaisance,24,,,241682500B0362,,,,,,,,,,,,,0,,,,,T,terres,,,1787,0.548704,44.706532
2020-277871,2020-12-28,000001,Vente,312500,41,,GROS BUISSON,B068,24560,24168,Plaisance,24,,,241682500B0363,,,,,,,,,,,,,0,1,Maison,110,5,S,sols,,,1900,0.548785,44.706833
2020-277871,2020-12-28,000001,Vente,312500,41,,GROS BUISSON,B068,24560,24168,Plaisance,24,,,241682500B0364,,,,,,,,,,,,,0,3,Dépendance,,0,S,sols,,,300,0.548891,44.707043
2020-277871,2020-12-28,000001,Vente,312500,41,,GROS BUISSON,B068,24560,24168,Plaisance,24,,,241682500B0364,,,,,,,,,,,,,0,3,Dépendance,,0,T,terres,,,1271,0.548891,44.707043
2020-277871,2020-12-28,000001,Vente,312500,,,GROS BUISSON,B068,24560,24168,Plaisance,24,,,241682500B0565,,,,,,,,,,,,,0,,,,,T,terres,,,6086,0.54888,44.707663
2020-277871,2020-12-28,000001,Vente,312500,,,GROS BUISSON,B068,24560,24168,Plaisance,24,,,241682500B0567,,,,,,,,,,,,,0,,,,,T,terres,,,51,0.548463,44.706417
2020-278267,2020-12-17,000001,Adjudication,13500,,,LES VALENCES,B138,24560,24168,Plaisance,24,,,241680000B0033,,,,,,,,,,,,,0,,,,,T,terres,,,12855,0.588159,44.709716
2020-278267,2020-12-17,000001,Adjudication,13500,,,LES VALENCES,B138,24560,24168,Plaisance,24,,,241680000B0033,,,,,,,,,,,,,0,,,,,T,terres,,,12855,0.588159,44.709716
2020-278267,2020-12-17,000001,Adjudication,13500,,,LES VALENCES,B138,24560,24168,Plaisance,24,,,241680000B0036,,,,,,,,,,,,,0,,,,,BT,taillis simples,,,9050,0.588016,44.710865
2020-278267,2020-12-17,000001,Adjudication,13500,,,CAMBUS,B030,24560,24168,Plaisance,24,,,241680000B0037,,,,,,,,,,,,,0,,,,,P,prés,,,5700,0.589098,44.710563
2020-278267,2020-12-17,000001,Adjudication,13500,,,CAMBUS,B030,24560,24168,Plaisance,24,,,241680000B0038,,,,,,,,,,,,,0,,,,,T,terres,,,7640,0.589045,44.711141
2020-278267,2020-12-17,000001,Adjudication,13500,,,CAMBUS,B030,24560,24168,Plaisance,24,,,241680000B0039,,,,,,,,,,,,,0,,,,,BT,taillis simples,,,6370,0.590271,44.711164
2020-278267,2020-12-17,000001,Adjudication,13500,,,CAMBUS,B030,24560,24168,Plaisance,24,,,241680000B0040,,,,,,,,,,,,,0,,,,,T,terres,,,10840,0.590461,44.710858
2020-278267,2020-12-17,000001,Adjudication,13500,,,LES VALENCES,B138,24560,24168,Plaisance,24,,,241680000B0552,,,,,,,,,,,,,0,,,,,L,landes,,,9785,0.587226,44.710457
2020-278267,2020-12-17,000001,Adjudication,13500,,,LES VALENCES,B138,24560,24168,Plaisance,24,,,241680000B0554,,,,,,,,,,,,,0,,,,,L,landes,,,115,0.586686,44.710996
2020-278267,2020-12-17,000001,Adjudication,13500,,,LES VALENCES,B138,24560,24168,Plaisance,24,,,241680000B0556,,,,,,,,,,,,,0,,,,,T,terres,,,400,0.586927,44.711361
2020-278330,2020-01-10,000001,Vente,202500,,,LES CHENEVRIERES,B039,24560,24168,Plaisance,24,,,241682500C0227,,,,,,,,,,,,,0,,,,,P,prés,,,190,0.556914,44.697058
2020-278330,2020-01-10,000001,Vente,202500,,,LES CHENEVRIERES,B039,24560,24168,Plaisance,24,,,241682500C0228,,,,,,,,,,,,,0,,,,,BP,peupleraies,,,7200,0.556217,44.697019
2020-278330,2020-01-10,000001,Vente,202500,,,LE GREZOU,B047,24560,24168,Plaisance,24,,,241680000D0086,,,,,,,,,,,,,0,,,,,BT,taillis simples,,,4140,0.55758,44.696088
2020-278330,2020-01-10,000001,Vente,202500,,,LE GREZOU,B047,24560,24168,Plaisance,24,,,241680000D0087,,,,,,,,,,,,,0,,,,,T,terres,,,3990,0.557088,44.696159
2020-278330,2020-01-10,000001,Vente,202500,,,LE GREZOU,B047,24560,24168,Plaisance,24,,,241680000D0088,,,,,,,,,,,,,0,,,,,BT,taillis simples,,,898,0.556706,44.696453
2020-278330,2020-01-10,000001,Vente,202500,1,,LE GREZOU,B047,24560,24168,Plaisance,24,,,241680000D0089,,,,,,,,,,,,,0,1,Maison,180,5,S,sols,,,560,0.556829,44.69672
2020-278330,2020-01-10,000001,Vente,202500,,,LE GREZOU,B047,24560,24168,Plaisance,24,,,241680000D0090,,,,,,,,,,,,,0,,,,,P,prés,,,1570,0.557155,44.696965
2020-278330,2020-01-10,000001,Vente,202500,,,LE GREZOU,B047,24560,24168,Plaisance,24,,,241680000D0091,,,,,,,,,,,,,0,,,,,BT,taillis simples,,,1260,0.557918,44.69689
2020-278330,2020-01-10,000001,Vente,202500,,,LE GREZOU,B047,24560,24168,Plaisance,24,,,241680000D0092,,,,,,,,,,,,,0,,,,,BT,taillis simples,,,660,0.558116,44.697025
2020-278330,2020-01-10,000001,Vente,202500,,,LE GREZOU,B047,24560,24168,Plaisance,24,,,241680000D0411,,,,,,,,,,,,,0,,,,,L,landes,,,425,0.557187,44.69667
2020-278390,2020-01-22,000001,Vente,165000,,,LES BOULBENNES,B016,24560,24168,Plaisance,24,,,241682500A0684,,,,,,,,,,,,,0,,,,,T,terres,,,3848,0.541544,44.715812
2020-278390,2020-01-22,000001,Vente,165000,,,PEPINLE,B104,24560,24168,Plaisance,24,,,241682500A0685,,,,,,,,,,,,,0,,,,,P,prés,,,808,0.54101,44.715431
2020-278390,2020-01-22,000001,Vente,165000,57,A,PEPINLE,B104,24560,24168,Plaisance,24,,,241682500A0928,,,,,,,,,,,,,0,1,Maison,83,5,S,sols,,,806,0.540739,44.715665
2020-278390,2020-01-22,000001,Vente,165000,57,A,PEPINLE,B104,24560,24168,Plaisance,24,,,241682500A0928,,,,,,,,,,,,,0,1,Maison,83,5,P,prés,,,1846,0.540739,44.715665
2020-278390,2020-01-22,000001,Vente,165000,,,PEPINLE,B104,24560,24168,Plaisance,24,,,241682500A0930,,,,,,,,,,,,,0,,,,,P,prés,,,2087,0.540228,44.715292
2020-279585,2020-07-03,000001,Vente,1623,,,LE MOULIN A VENT,B089,24560,24168,Plaisance,24,,,241681730A0146,,,,,,,,,,,,,0,,,,,T,terres,,,2705,0.525589,44.685929
2020-279872,2020-07-23,000001,Vente,7500,,,LES CABARROUX,B028,24560,24168,Plaisance,24,,,241680000B0049,,,,,,,,,,,,,0,,,,,T,terres,,,1181,0.596117,44.706564
2020-279872,2020-07-23,000001,Vente,7500,,,LES CABARROUX,B028,24560,24168,Plaisance,24,,,241680000B0720,,,,,,,,,,,,,0,,,,,T,terres,,,3152,0.595066,44.705751
2020-279872,2020-07-23,000001,Vente,7500,,,LES CABARROUX,B028,24560,24168,Plaisance,24,,,241680000B0721,,,,,,,,,,,,,0,,,,,BT,taillis simples,,,351,0.595219,44.705505
2020-279872,2020-07-23,000001,Vente,7500,,,LES CABARROUX,B028,24560,24168,Plaisance,24,,,241680000B0725,,,,,,,,,,,,,0,,,,,P,prés,,,13257,0.595485,44.706211
2020-279880,2020-07-23,000002,Echange,147,,,LES CABARROUX,B028,24560,24168,Plaisance,24,,,241680000B0721,,,,,,,,,,,,,0,,,,,BT,taillis simples,,,351,0.595219,44.705505
2020-279881,2020-07-23,000003,Echange,603,,,LES CABARROUX,B028,24560,24168,Plaisance,24,,,241680000B0719,,,,,,,,,,,,,0,,,,,T,terres,,,958,0.594753,44.706033
2020-279881,2020-07-23,000003,Echange,603,,,LES CABARROUX,B028,24560,24168,Plaisance,24,,,241680000B0723,,,,,,,,,,,,,0,,,,,P,prés,,,484,0.59487,44.706378
2020-279926,2020-08-04,000001,Vente,804293,,,LES GIRONNETS,B145,24560,24168,Plaisance,24,,,241680000A0248,,,,,,,,,,,,,0,,,,,T,terres,,,22090,0.570545,44.716772
2020-279926,2020-08-04,000001,Vente,804293,,,LES GIRONNETS,B145,24560,24168,Plaisance,24,,,241680000A0249,,,,,,,,,,,,,0,,,,,T,terres,,,1190,0.571176,44.717043
2020-279926,2020-08-04,000001,Vente,804293,,,LES GIRONNETS,B145,24560,24168,Plaisance,24,,,241680000A0250,,,,,,,,,,,,,0,,,,,T,terres,,,13820,0.571411,44.717133
2020-279926,2020-08-04,000001,Vente,804293,52,,FOUSSAL,B056,24560,24168,Plaisance,24,,,241680000A0386,,,,,,,,,,,,,0,1,Maison,430,13,S,sols,,,412,0.574112,44.716423
2020-279926,2020-08-04,000001,Vente,804293,,,FOUSSAL,B056,24560,24168,Plaisance,24,,,241680000A0391,,,,,,,,,,,,,0,,,,,S,sols,,,500,0.573231,44.715723
2020-279926,2020-08-04,000001,Vente,804293,,,FOUSSAL,B056,24560,24168,Plaisance,24,,,241680000A0391,,,,,,,,,,,,,0,,,,,P,prés,,,5740,0.573231,44.715723
2020-279926,2020-08-04,000001,Vente,804293,,,LES GIRONNETS,B145,24560,24168,Plaisance,24,,,241680000A0831,,,,,,,,,,,,,0,,,,,P,prés,,,10119,0.572397,44.715891
2020-279926,2020-08-04,000001,Vente,804293,,,FOUSSAL,B056,24560,24168,Plaisance,24,,,241680000A0833,,,,,,,,,,,,,0,,,,,L,landes,,,109,0.573206,44.716794
2020-279926,2020-08-04,000001,Vente,804293,,,FOUSSAL,B056,24560,24168,Plaisance,24,,,241680000A0835,,,,,,,,,,,,,0,,,,,L,landes,,,418,0.573356,44.716623
2020-279926,2020-08-04,000001,Vente,804293,,,FOUSSAL,B056,24560,24168,Plaisance,24,,,241680000A0836,,,,,,,,,,,,,0,,,,,L,landes,,,51,0.57253,44.715207
2020-279926,2020-08-04,000001,Vente,804293,52,A,FOUSSAL,B056,24560,24168,Plaisance,24,,,241680000A0923,,,,,,,,,,,,,0,3,Dépendance,,0,S,sols,,,400,0.573931,44.716468
2020-279926,2020-08-04,000001,Vente,804293,52,A,FOUSSAL,B056,24560,24168,Plaisance,24,,,241680000A0923,,,,,,,,,,,,,0,3,Dépendance,,0,AG,terrains d'agrément,,,8602,0.573931,44.716468
2020-279926,2020-08-04,000001,Vente,804293,,,FOUSSAL,B056,24560,24168,Plaisance,24,,,241680000A0925,,,,,,,,,,,,,0,,,,,P,prés,,,668,0.574743,44.716365
2020-279926,2020-08-04,000001,Vente,804293,,,FOUSSAL,B056,24560,24168,Plaisance,24,,,241680000A0927,,,,,,,,,,,,,0,,,,,P,prés,,,1924,0.574619,44.716081
2020-279926,2020-08-04,000001,Vente,804293,,,LES GIRONNETS,B145,24560,24168,Plaisance,24,,,241680000A0959,,,,,,,,,,,,,0,,,,,BT,taillis simples,,,10393,0.571222,44.715848
2020-279932,2020-08-05,000001,Vente,15000,,,LA PAILLOULETTE,B098,24560,24168,Plaisance,24,,,241680000A0580,,,,,,,,,,,,,0,,,,,T,terres,,,1490,0.567457,44.698912
2020-280060,2020-08-17,000001,Vente,135000,,,LES GIRONNETS,B145,24560,24168,Plaisance,24,,,241680000A0261,,,,,,,,,,,,,0,,,,,T,terres,,,3831,0.572218,44.719178
2020-280060,2020-08-17,000001,Vente,135000,55,,LES GIRONNETS,B145,24560,24168,Plaisance,24,,,241680000A0262,,,,,,,,,,,,,0,3,Dépendance,,0,S,sols,,,1299,0.572729,44.719007
2020-280060,2020-08-17,000001,Vente,135000,55,,LES GIRONNETS,B145,24560,24168,Plaisance,24,,,241680000A0262,,,,,,,,,,,,,0,1,Maison,156,3,S,sols,,,1299,0.572729,44.719007
2020-280060,2020-08-17,000001,Vente,135000,,,LES GIRONNETS,B145,24560,24168,Plaisance,24,,,241680000A0961,,,,,,,,,,,,,0,,,,,T,terres,,,3940,0.57188,44.719385
2020-280060,2020-08-17,000001,Vente,135000,,,LES GIRONNETS,B145,24560,24168,Plaisance,24,,,241680000A0963,,,,,,,,,,,,,0,,,,,T,terres,,,5859,0.571431,44.718382
2020-280060,2020-08-17,000001,Vente,135000,,,LES GIRONNETS,B145,24560,24168,Plaisance,24,,,241680000A0980,,,,,,,,,,,,,0,,,,,S,sols,,,500,0.572937,44.718413
2020-280060,2020-08-17,000001,Vente,135000,,,LES GIRONNETS,B145,24560,24168,Plaisance,24,,,241680000A0980,,,,,,,,,,,,,0,,,,,L,landes,,,3254,0.572937,44.718413
2020-280060,2020-08-17,000001,Vente,135000,,,LES GIRONNETS,B145,24560,24168,Plaisance,24,,,241680000A0980,,,,,,,,,,,,,0,,,,,T,terres,,,20115,0.572937,44.718413
2020-280060,2020-08-17,000001,Vente,135000,,,LES GIRONNETS,B145,24560,24168,Plaisance,24,,,241680000A0982,,,,,,,,,,,,,0,,,,,T,terres,,,145,0.574195,44.718835
2020-280227,2020-09-03,000001,Vente,180000,,,LES GOUDOUNECHES,B059,24560,24168,Plaisance,24,,,241682500A0035,,,,,,,,,,,,,0,,,,,BT,taillis simples,,,9230,0.534449,44.710984
2020-280227,2020-09-03,000001,Vente,180000,,,LES GOUDOUNECHES,B059,24560,24168,Plaisance,24,,,241682500A0039,,,,,,,,,,,,,0,,,,,BT,taillis simples,,,1394,0.532782,44.713102
2020-280227,2020-09-03,000001,Vente,180000,,,LES GOUDOUNECHES,B059,24560,24168,Plaisance,24,,,241682500A0041,,,,,,,,,,,,,0,,,,,T,terres,,,878,0.532361,44.713502
2020-280227,2020-09-03,000001,Vente,180000,,,LES GOUDOUNECHES,B059,24560,24168,Plaisance,24,,,241682500A0042,,,,,,,,,,,,,0,,,,,T,terres,,,52,0.532148,44.713629
2020-280227,2020-09-03,000001,Vente,180000,,,LES GOUDOUNECHES,B059,24560,24168,Plaisance,24,,,241682500A0043,,,,,,,,,,,,,0,,,,,T,terres,,,420,0.532464,44.713663
2020-280227,2020-09-03,000001,Vente,180000,,,LES GOUDOUNECHES,B059,24560,24168,Plaisance,24,,,241682500A0813,,,,,,,,,,,,,0,,,,,L,landes,,,1697,0.530993,44.713059
2020-280227,2020-09-03,000001,Vente,180000,,,LES GOUDOUNECHES,B059,24560,24168,Plaisance,24,,,241682500A0995,,,,,,,,,,,,,0,,,,,T,terres,,,542,0.532688,44.713754
2020-280227,2020-09-03,000001,Vente,180000,,,LES GOUDOUNECHES,B059,24560,24168,Plaisance,24,,,241682500A0997,,,,,,,,,,,,,0,,,,,S,sols,,,246,0.532908,44.713943
2020-280227,2020-09-03,000001,Vente,180000,,,LES GOUDOUNECHES,B059,24560,24168,Plaisance,24,,,241682500A0998,,,,,,,,,,,,,0,,,,,L,landes,,,1450,0.533498,44.71445
2020-280227,2020-09-03,000001,Vente,180000,,,LES GOUDOUNECHES,B059,24560,24168,Plaisance,24,,,241682500A1004,,,,,,,,,,,,,0,,,,,L,landes,,,6572,0.532605,44.713347
2020-280227,2020-09-03,000001,Vente,180000,53,A,LES GOUDOUNECHES,B059,24560,24168,Plaisance,24,,,241682500A1030,,,,,,,,,,,,,0,1,Maison,80,3,S,sols,,,1183,0.532583,44.714021
2020-280390,2020-09-25,000001,Vente,630000,,,LES NEUF PIERRES,B093,24560,24168,Plaisance,24,,,241680000A0372,,,,,,,,,,,,,0,,,,,T,terres,,,726,0.579361,44.716762
2020-280390,2020-09-25,000001,Vente,630000,,,LES NEUF PIERRES,B093,24560,24168,Plaisance,24,,,241680000A0373,,,,,,,,,,,,,0,,,,,T,terres,,,582,0.579266,44.716582
2020-280390,2020-09-25,000001,Vente,630000,,,LES NEUF PIERRES,B093,24560,24168,Plaisance,24,,,241680000A0374,,,,,,,,,,,,,0,,,,,T,terres,,,882,0.579845,44.716306
2020-280390,2020-09-25,000001,Vente,630000,,,FOUSSAL,B056,24560,24168,Plaisance,24,,,241680000A0376,,,,,,,,,,,,,0,,,,,T,terres,,,2190,0.579143,44.716349
2020-280390,2020-09-25,000001,Vente,630000,,,FOUSSAL,B056,24560,24168,Plaisance,24,,,241680000A0378,,,,,,,,,,,,,0,,,,,T,terres,,,19380,0.577366,44.715786
2020-280390,2020-09-25,000001,Vente,630000,,,FOUSSAL,B056,24560,24168,Plaisance,24,,,241680000A0379,,,,,,,,,,,,,0,,,,,BT,taillis simples,,,1130,0.576864,44.716341
2020-280390,2020-09-25,000001,Vente,630000,53,A,FOUSSAL,B056,24560,24168,Plaisance,24,,,241680000A0380,,,,,,,,,,,,,0,3,Dépendance,,0,S,sols,,,800,0.576275,44.716535
2020-280390,2020-09-25,000001,Vente,630000,53,A,FOUSSAL,B056,24560,24168,Plaisance,24,,,241680000A0380,,,,,,,,,,,,,0,3,Dépendance,,0,J,jardins,,,1670,0.576275,44.716535
2020-280390,2020-09-25,000001,Vente,630000,,,FOUSSAL,B056,24560,24168,Plaisance,24,,,241680000A0388,,,,,,,,,,,,,0,,,,,S,sols,,,780,0.575877,44.71627
2020-280390,2020-09-25,000001,Vente,630000,,,FOUSSAL,B056,24560,24168,Plaisance,24,,,241680000A0389,,,,,,,,,,,,,0,,,,,P,prés,,,600,0.575761,44.716011
2020-280390,2020-09-25,000001,Vente,630000,,,LES NEUF PIERRES,B093,24560,24168,Plaisance,24,,,241680000A0726,,,,,,,,,,,,,0,,,,,T,terres,,,740,0.579438,44.717116
2020-280390,2020-09-25,000001,Vente,630000,,,LES NEUF PIERRES,B093,24560,24168,Plaisance,24,,,241680000A0728,,,,,,,,,,,,,0,,,,,T,terres,,,5562,0.579831,44.716741
2020-280390,2020-09-25,000001,Vente,630000,,,FOUSSAL,B056,24560,24168,Plaisance,24,,,241680000A0801,,,,,,,,,,,,,0,,,,,L,landes,,,760,0.574141,44.717354
2020-280390,2020-09-25,000001,Vente,630000,,,FOUSSAL,B056,24560,24168,Plaisance,24,,,241680000A0839,,,,,,,,,,,,,0,,,,,L,landes,,,133,0.574703,44.717806
2020-280390,2020-09-25,000001,Vente,630000,,,FOUSSAL,B056,24560,24168,Plaisance,24,,,241680000A0924,,,,,,,,,,,,,0,,,,,AG,terrains d'agrément,,,330,0.574925,44.716608
2020-280390,2020-09-25,000001,Vente,630000,,,FOUSSAL,B056,24560,24168,Plaisance,24,,,241680000A0926,,,,,,,,,,,,,0,,,,,P,prés,,,2152,0.575402,44.716366
2020-280390,2020-09-25,000001,Vente,630000,,,FOUSSAL,B056,24560,24168,Plaisance,24,,,241680000A0928,,,,,,,,,,,,,0,,,,,P,prés,,,2916,0.575372,44.716105
2020-280390,2020-09-25,000001,Vente,630000,53,,FOUSSAL,B056,24560,24168,Plaisance,24,,,241680000A0978,,,,,,,,,,,,,0,1,Maison,206,5,T,terres,,,26114,0.576728,44.717222
2020-280390,2020-09-25,000001,Vente,630000,53,,FOUSSAL,B056,24560,24168,Plaisance,24,,,241680000A0978,,,,,,,,,,,,,0,1,Maison,206,5,T,terres,,,26114,0.576728,44.717222
2020-280390,2020-09-25,000001,Vente,630000,53,,FOUSSAL,B056,24560,24168,Plaisance,24,,,241680000A0978,,,,,,,,,,,,,0,1,Maison,206,5,T,terres,,,26115,0.576728,44.717222
2020-280390,2020-09-25,000001,Vente,630000,53,,FOUSSAL,B056,24560,24168,Plaisance,24,,,241680000A0978,,,,,,,,,,,,,0,1,Maison,206,5,S,sols,,,2837,0.576728,44.717222
2020-280390,2020-09-25,000001,Vente,630000,,,FOUSSAL,B056,24560,24168,Plaisance,24,,,241680000A0998,,,,,,,,,,,,,0,,,,,T,terres,,,1728,0.574559,44.717549
2020-280478,2020-10-12,000001,Vente,15500,,,LES VIGNES,B140,24560,24168,Plaisance,24,,,241682500B0695,,,,,,,,,,,,,0,,,,,T,terres,,,3170,0.549514,44.713803
2020-280500,2020-10-15,000001,Vente,167827,15,,MESSINE OUEST,B086,24560,24168,Plaisance,24,,,241681730A0078,,,,,,,,,,,,,0,1,Maison,104,6,S,sols,,,800,0.544414,44.674221
2020-280500,2020-10-15,000001,Vente,167827,,,FALGUEYRAT-EST,B022,24560,24168,Plaisance,24,,,241681730A0301,,,,,,,,,,,,,0,,,,,L,landes,,,1918,0.543788,44.673874
2020-280500,2020-10-15,000001,Vente,167827,,,MESSINE OUEST,B086,24560,24168,Plaisance,24,,,241681730A0303,,,,,,,,,,,,,0,,,,,L,landes,,,706,0.544563,44.674171
2020-280527,2020-10-14,000001,Vente,230000,27,,JEAN DIGEAUX NORD,B073,24560,24168,Plaisance,24,,,241680000C0859,,,,,,,,,,,,,0,4,Local industriel. commercial ou assimilé,270,0,S,sols,,,1023,0.55823,44.683997
2020-280529,2020-10-14,000002,Vente,10000,,,JEAN DIGEAUX NORD,B073,24560,24168,Plaisance,24,,,241680000C0842,,,,,,,,,,,,,0,,,,,S,sols,,,300,0.558538,44.684082
2020-280529,2020-10-14,000002,Vente,10000,,,JEAN DIGEAUX NORD,B073,24560,24168,Plaisance,24,,,241680000C0842,,,,,,,,,,,,,0,,,,,P,prés,,,2556,0.558538,44.684082
2020-280707,2020-11-05,000001,Vente,440000,,,LE MAINE CHEVALIER,B080,24560,24168,Plaisance,24,,,241682500C1090,,,,,,,,,,,,,0,,,,,BS,taillis sous futaie,,,3240,0.536162,44.700312
2020-280707,2020-11-05,000001,Vente,440000,77,,LE MAINE CHEVALIER,B080,24560,24168,Plaisance,24,,,241682500C1092,,,,,,,,,,,,,0,3,Dépendance,,0,S,sols,,,500,0.536404,44.700457
2020-280707,2020-11-05,000001,Vente,440000,77,,LE MAINE CHEVALIER,B080,24560,24168,Plaisance,24,,,241682500C1092,,,,,,,,,,,,,0,3,Dépendance,,0,P,prés,,,974,0.536404,44.700457
2020-280707,2020-11-05,000001,Vente,440000,77,,LE MAINE CHEVALIER,B080,24560,24168,Plaisance,24,,,241682500C1094,,,,,,,,,,,,,0,1,Maison,148,6,P,prés,,,3017,0.536674,44.699943
2020-280707,2020-11-05,000001,Vente,440000,77,,LE MAINE CHEVALIER,B080,24560,24168,Plaisance,24,,,241682500C1094,,,,,,,,,,,,,0,1,Maison,148,6,S,sols,,,800,0.536674,44.699943
2020-280707,2020-11-05,000001,Vente,440000,,,LE MAINE CHEVALIER,B080,24560,24168,Plaisance,24,,,241682500C1096,,,,,,,,,,,,,0,,,,,S,sols,,,139,0.536998,44.700059
2020-280707,2020-11-05,000001,Vente,440000,,,LE MAINE CHEVALIER,B080,24560,24168,Plaisance,24,,,241682500C1098,,,,,,,,,,,,,0,,,,,L,landes,,,131,0.536921,44.700126
