id_mutation,date_mutation,numero_disposition,nature_mutation,valeur_fonciere,adresse_numero,adresse_suffixe,adresse_nom_voie,adresse_code_voie,code_postal,code_commune,nom_commune,code_departement,ancien_code_commune,ancien_nom_commune,id_parcelle,ancien_id_parcelle,numero_volume,lot1_numero,lot1_surface_carrez,lot2_numero,lot2_surface_carrez,lot3_numero,lot3_surface_carrez,lot4_numero,lot4_surface_carrez,lot5_numero,lot5_surface_carrez,nombre_lots,code_type_local,type_local,surface_reelle_bati,nombre_pieces_principales,code_nature_culture,nature_culture,code_nature_culture_speciale,nature_culture_speciale,surface_terrain,longitude,latitude
2020-277028,2020-12-17,000001,Vente,5200,,,PORT DE CALVIAC,B039,24370,24470,Sainte-Mondane,24,,,244700000A0026,,,,,,,,,,,,,0,,,,,P,prés,,,1731,1.336776,44.848632
2020-277028,2020-12-17,000001,Vente,5200,,,PORT DE CALVIAC,B039,24370,24470,Sainte-Mondane,24,,,244700000A0027,,,,,,,,,,,,,0,,,,,P,prés,,,560,1.336781,44.848314
2020-277959,2020-12-30,000001,Vente,298800,211,,LARUE,B023,24370,24470,Sainte-Mondane,24,,,244700000B0140,,,,,,,,,,,,,0,3,Dépendance,,0,S,sols,,,500,1.327327,44.843382
2020-277959,2020-12-30,000001,Vente,298800,211,,LARUE,B023,24370,24470,Sainte-Mondane,24,,,244700000B0140,,,,,,,,,,,,,0,3,Dépendance,,0,P,prés,,,2110,1.327327,44.843382
2020-277959,2020-12-30,000001,Vente,298800,,,LARUE,B023,24370,24470,Sainte-Mondane,24,,,244700000B0141,,,,,,,,,,,,,0,,,,,P,prés,,,1170,1.327319,44.843643
2020-277959,2020-12-30,000001,Vente,298800,,,LARUE,B023,24370,24470,Sainte-Mondane,24,,,244700000B0142,,,,,,,,,,,,,0,,,,,T,terres,,,1230,1.327729,44.843816
2020-277959,2020-12-30,000001,Vente,298800,,,LARUE,B023,24370,24470,Sainte-Mondane,24,,,244700000B0143,,,,,,,,,,,,,0,,,,,L,landes,,,585,1.328082,44.843649
2020-277959,2020-12-30,000001,Vente,298800,757,,RTE DE LA PINTOUNE,0720,24370,24470,Sainte-Mondane,24,,,244700000B0144,,,,,,,,,,,,,0,1,Maison,187,7,S,sols,,,960,1.327992,44.843522
2020-278076,2020-12-30,000001,Vente,322000,,,RAYSSE PROCUREUR,B040,24370,24470,Sainte-Mondane,24,,,244700000A0470,,,,,,,,,,,,,0,,,,,J,jardins,POTAG,Jardin potager,180,1.343435,44.841902
2020-278076,2020-12-30,000001,Vente,322000,,,RAYSSE PROCUREUR,B040,24370,24470,Sainte-Mondane,24,,,244700000A0471,,,,,,,,,,,,,0,,,,,P,prés,,,500,1.343737,44.841753
2020-278076,2020-12-30,000001,Vente,322000,,,RAYSSE PROCUREUR,B040,24370,24470,Sainte-Mondane,24,,,244700000A0471,,,,,,,,,,,,,0,,,,,S,sols,,,500,1.343737,44.841753
2020-278076,2020-12-30,000001,Vente,322000,,,RAYSSE PROCUREUR,B040,24370,24470,Sainte-Mondane,24,,,244700000A0478,,,,,,,,,,,,,0,,,,,T,terres,,,750,1.344025,44.841535
2020-278076,2020-12-30,000001,Vente,322000,208,,RTE DE FENELON,0270,24370,24470,Sainte-Mondane,24,,,244700000A0486,,,,,,,,,,,,,0,1,Maison,50,3,S,sols,,,555,1.34324,44.841955
2020-278076,2020-12-30,000001,Vente,322000,,,LE BOURG,B012,24370,24470,Sainte-Mondane,24,,,244700000A0487,,,,,,,,,,,,,0,,,,,J,jardins,POTAG,Jardin potager,860,1.343149,44.842199
2020-278076,2020-12-30,000001,Vente,322000,,,RAYSSE PROCUREUR,B040,24370,24470,Sainte-Mondane,24,,,244700000A0907,,,,,,,,,,,,,0,,,,,BT,taillis simples,,,2490,1.343622,44.84214
2020-278076,2020-12-30,000001,Vente,322000,,,RAYSSE PROCUREUR,B040,24370,24470,Sainte-Mondane,24,,,244700000A0909,,,,,,,,,,,,,0,,,,,BT,taillis simples,,,2805,1.344192,44.841925
2020-278076,2020-12-30,000001,Vente,322000,,,RAYSSE PROCUREUR,B040,24370,24470,Sainte-Mondane,24,,,244700000A0911,,,,,,,,,,,,,0,,,,,BT,taillis simples,,,589,1.344591,44.84191
2020-278076,2020-12-30,000001,Vente,322000,,,RAYSSE PROCUREUR,B040,24370,24470,Sainte-Mondane,24,,,244700000A1523,,,,,,,,,,,,,0,,,,,BT,taillis simples,,,743,1.344307,44.841583
2020-278076,2020-12-30,000001,Vente,322000,,,RAYSSE PROCUREUR,B040,24370,24470,Sainte-Mondane,24,,,244700000A1630,,,,,,,,,,,,,0,,,,,P,prés,,,333,1.3433,44.842315
2020-278076,2020-12-30,000001,Vente,322000,,,LE BOURG,B012,24370,24470,Sainte-Mondane,24,,,244700000A1632,,,,,,,,,,,,,0,,,,,BT,taillis simples,,,450,1.343297,44.842109
2020-278076,2020-12-30,000001,Vente,322000,,,LE BOURG,B012,24370,24470,Sainte-Mondane,24,,,244700000A1740,,,,,,,,,,,,,0,,,,,BT,taillis simples,,,1175,1.343022,44.842578
2020-282228,2020-02-24,000002,Vente,128000,,,LE BOURG,B012,24370,24470,Sainte-Mondane,24,,,244700000A0483,,,,,,,,,,,,,0,,,,,J,jardins,POTAG,Jardin potager,355,,
2020-282228,2020-02-24,000002,Vente,128000,,,LE BOURG,B012,24370,24470,Sainte-Mondane,24,,,244700000A0484,,,,,,,,,,,,,0,,,,,T,terres,,,610,,
2020-282228,2020-02-24,000002,Vente,128000,,,LE BOURG,B012,24370,24470,Sainte-Mondane,24,,,244700000A0485,,,,,,,,,,,,,0,,,,,BT,taillis simples,,,2065,1.342868,44.841679
2020-282228,2020-02-24,000002,Vente,128000,,,BOS DU NEVEU,B010,24370,24470,Sainte-Mondane,24,,,244700000A0842,,,,,,,,,,,,,0,,,,,T,terres,,,1860,1.359215,44.838138
2020-282361,2020-03-16,000001,Vente,1200,,,PECH DE COURBET,B031,24370,24470,Sainte-Mondane,24,,,244700000B1050,,,,,,,,,,,,,0,,,,,BT,taillis simples,,,1030,1.335334,44.838475
2020-282361,2020-03-16,000001,Vente,1200,,,PECH DE COURBET,B031,24370,24470,Sainte-Mondane,24,,,244700000B1051,,,,,,,,,,,,,0,,,,,BT,taillis simples,,,3500,1.334855,44.838541
2020-282882,2020-06-19,000002,Vente,320700,,,LARUE,B023,24370,24470,Sainte-Mondane,24,,,244700000B0123,,,,,,,,,,,,,0,,,,,L,landes,,,90,1.328127,44.842463
2020-282882,2020-06-19,000002,Vente,320700,,,LARUE,B023,24370,24470,Sainte-Mondane,24,,,244700000B0124,,,,,,,,,,,,,0,,,,,S,sols,,,65,1.328169,44.842545
2020-282882,2020-06-19,000002,Vente,320700,,,LARUE,B023,24370,24470,Sainte-Mondane,24,,,244700000B1403,,,,,,,,,,,,,0,,,,,P,prés,,,7215,1.32696,44.842636
2020-282882,2020-06-19,000002,Vente,320700,99,,IMP DE LARUE,0470,24370,24470,Sainte-Mondane,24,,,244700000B1404,,,,,,,,,,,,,0,1,Maison,235,7,S,sols,,,2980,1.327961,44.842587
2020-282882,2020-06-19,000002,Vente,320700,,,LARUE,B023,24370,24470,Sainte-Mondane,24,,,244700000B1644,,,,,,,,,,,,,0,,,,,S,sols,,,154,1.328126,44.842754
2020-282882,2020-06-19,000002,Vente,320700,,,LARUE,B023,24370,24470,Sainte-Mondane,24,,,244700000B1724,,,,,,,,,,,,,0,,,,,T,terres,,,1162,1.326862,44.84187
2020-282882,2020-06-19,000002,Vente,320700,,,LARUE,B023,24370,24470,Sainte-Mondane,24,,,244700000B1726,,,,,,,,,,,,,0,,,,,BT,taillis simples,,,2804,1.327371,44.843064
2020-282882,2020-06-19,000002,Vente,320700,,,LARUE,B023,24370,24470,Sainte-Mondane,24,,,244700000B1728,,,,,,,,,,,,,0,,,,,BT,taillis simples,,,2369,1.326787,44.843167
2020-282978,2020-06-30,000001,Vente,608617,,,BOS DU NEVEU,B010,24370,24470,Sainte-Mondane,24,,,244700000A0830,,,,,,,,,,,,,0,,,,,T,terres,,,3150,1.359838,44.83967
2020-282978,2020-06-30,000001,Vente,608617,,,BOS DU NEVEU,B010,24370,24470,Sainte-Mondane,24,,,244700000A0831,,,,,,,,,,,,,0,,,,,T,terres,,,900,1.360003,44.840023
2020-282978,2020-06-30,000001,Vente,608617,,,BOS DU NEVEU,B010,24370,24470,Sainte-Mondane,24,,,244700000A0832,,,,,,,,,,,,,0,,,,,T,terres,,,2600,1.359243,44.840159
2020-282978,2020-06-30,000001,Vente,608617,,,BOS DU NEVEU,B010,24370,24470,Sainte-Mondane,24,,,244700000A0833,,,,,,,,,,,,,0,,,,,T,terres,,,930,1.359229,44.839783
2020-282978,2020-06-30,000001,Vente,608617,,,BOS DU NEVEU,B010,24370,24470,Sainte-Mondane,24,,,244700000A0834,,,,,,,,,,,,,0,,,,,T,terres,,,600,1.358789,44.840082
2020-282978,2020-06-30,000001,Vente,608617,,,BOS DU NEVEU,B010,24370,24470,Sainte-Mondane,24,,,244700000A0835,,,,,,,,,,,,,0,,,,,BT,taillis simples,,,1400,1.358512,44.840157
2020-282978,2020-06-30,000001,Vente,608617,9,,IMP DES CHEVRES,0150,24370,24470,Sainte-Mondane,24,,,244700000A0836,,,,,,,,,,,,,0,1,Maison,102,3,S,sols,,,2355,1.35858,44.839567
2020-282978,2020-06-30,000001,Vente,608617,9,,IMP DES CHEVRES,0150,24370,24470,Sainte-Mondane,24,,,244700000A0836,,,,,,,,,,,,,0,4,Local industriel. commercial ou assimilé,235,0,S,sols,,,2355,1.35858,44.839567
2020-282978,2020-06-30,000001,Vente,608617,,,BOS DU NEVEU,B010,24370,24470,Sainte-Mondane,24,,,244700000A1712,,,,,,,,,,,,,0,,,,,T,terres,,,2117,1.359003,44.839491
2020-282978,2020-06-30,000001,Vente,608617,,,BOS DU NEVEU,B010,24370,24470,Sainte-Mondane,24,,,244700000A1712,,,,,,,,,,,,,0,,,,,S,sols,,,1000,1.359003,44.839491
2020-282987,2020-07-09,000001,Vente,1600,,,PECH CASALOU,B030,24370,24470,Sainte-Mondane,24,,,244700000A0377,,,,,,,,,,,,,0,,,,,T,terres,,,1180,1.352511,44.849718
2020-282987,2020-07-09,000001,Vente,1600,,,PECH CASALOU,B030,24370,24470,Sainte-Mondane,24,,,244700000A0379,,,,,,,,,,,,,0,,,,,T,terres,,,700,1.352282,44.850447
2020-282987,2020-07-09,000001,Vente,1600,,,PECH CASALOU,B030,24370,24470,Sainte-Mondane,24,,,244700000A0380,,,,,,,,,,,,,0,,,,,T,terres,,,1570,1.35266,44.8502
2020-282987,2020-07-09,000001,Vente,1600,,,PECH CASALOU,B030,24370,24470,Sainte-Mondane,24,,,244700000A0387,,,,,,,,,,,,,0,,,,,T,terres,,,430,1.353,44.850021
2020-282987,2020-07-09,000001,Vente,1600,,,LA BARTISSOLLE,B006,24370,24470,Sainte-Mondane,24,,,244700000B0478,,,,,,,,,,,,,0,,,,,BT,taillis simples,,,1105,1.329583,44.841533
2020-282987,2020-07-09,000001,Vente,1600,,,LA BARTISSOLLE,B006,24370,24470,Sainte-Mondane,24,,,244700000B0479,,,,,,,,,,,,,0,,,,,BT,taillis simples,,,1130,1.330103,44.84156
2020-283106,2020-08-05,000001,Vente,173010,702,,RTE DE MIOUDRE,0570,24370,24470,Sainte-Mondane,24,,,244700000A0424,,,,,,,,,,,,,0,3,Dépendance,,0,P,prés,,,1870,,
2020-283106,2020-08-05,000001,Vente,173010,702,,RTE DE MIOUDRE,0570,24370,24470,Sainte-Mondane,24,,,244700000A0424,,,,,,,,,,,,,0,1,Maison,103,5,P,prés,,,1870,,
2020-283106,2020-08-05,000001,Vente,173010,702,,RTE DE MIOUDRE,0570,24370,24470,Sainte-Mondane,24,,,244700000A0424,,,,,,,,,,,,,0,1,Maison,103,5,S,sols,,,1000,,
2020-283106,2020-08-05,000001,Vente,173010,702,,RTE DE MIOUDRE,0570,24370,24470,Sainte-Mondane,24,,,244700000A0424,,,,,,,,,,,,,0,3,Dépendance,,0,S,sols,,,1000,,
2020-283106,2020-08-05,000001,Vente,173010,,,LE BOURG,B012,24370,24470,Sainte-Mondane,24,,,244700000A0532,,,,,,,,,,,,,0,,,,,BT,taillis simples,,,1470,1.345268,44.845842
2020-283452,2020-09-15,000001,Vente,900,,,LA PLAINE HAUTE,B037,24370,24470,Sainte-Mondane,24,,,244700000A0795,,,,,,,,,,,,,0,,,,,BT,taillis simples,,,1810,1.363705,44.843676
2020-283452,2020-09-15,000001,Vente,900,,,LA PLAINE HAUTE,B037,24370,24470,Sainte-Mondane,24,,,244700000A0796,,,,,,,,,,,,,0,,,,,BT,taillis simples,,,5380,1.362689,44.844242
