id_mutation,date_mutation,numero_disposition,nature_mutation,valeur_fonciere,adresse_numero,adresse_suffixe,adresse_nom_voie,adresse_code_voie,code_postal,code_commune,nom_commune,code_departement,ancien_code_commune,ancien_nom_commune,id_parcelle,ancien_id_parcelle,numero_volume,lot1_numero,lot1_surface_carrez,lot2_numero,lot2_surface_carrez,lot3_numero,lot3_surface_carrez,lot4_numero,lot4_surface_carrez,lot5_numero,lot5_surface_carrez,nombre_lots,code_type_local,type_local,surface_reelle_bati,nombre_pieces_principales,code_nature_culture,nature_culture,code_nature_culture_speciale,nature_culture_speciale,surface_terrain,longitude,latitude
2020-293073,2020-01-22,000001,Vente,306000,13,,RUE DES DOLINES,0025,25500,25050,Le Bélieu,25,,,25050000AE0028,,,,,,,,,,,,,0,4,Local industriel. commercial ou assimilé,300,0,S,sols,,,2370,6.626869,47.104824
2020-293074,2020-02-12,000001,Vente,130000,5059,,COMBOTTE MARTIN ET SOUS BO,B056,25500,25050,Le Bélieu,25,,,25050000AC0061,,,,,,,,,,,,,0,1,Maison,247,16,S,sols,,,921,6.636441,47.120027
2020-293484,2020-04-24,000001,Vente,373350,2,,LE CLOS BECQUET,0019,25500,25050,Le Bélieu,25,,,25050000AC0010,,,,,,,,,,,,,0,3,Dépendance,,0,S,sols,,,1065,6.635401,47.120688
2020-293484,2020-04-24,000001,Vente,373350,2,,LE CLOS BECQUET,0019,25500,25050,Le Bélieu,25,,,25050000AC0010,,,,,,,,,,,,,0,1,Maison,132,4,S,sols,,,1065,6.635401,47.120688
2020-293776,2020-06-18,000001,Vente,456000,,,CLOS EPENOY,B044,25500,25050,Le Bélieu,25,,,25050000AD0056,,,,,,,,,,,,,0,,,,,T,terres,,,186,6.643597,47.112774
2020-293776,2020-06-18,000001,Vente,456000,11,,CHE DES MARAIS,0043,25500,25050,Le Bélieu,25,,,25050000AD0057,,,,,,,,,,,,,0,2,Appartement,160,4,S,sols,,,1901,6.643517,47.112542
2020-293776,2020-06-18,000001,Vente,456000,11,,CHE DES MARAIS,0043,25500,25050,Le Bélieu,25,,,25050000AD0057,,,,,,,,,,,,,0,2,Appartement,150,3,S,sols,,,1901,6.643517,47.112542
2020-293776,2020-06-18,000001,Vente,456000,,,CHE DES MARAIS,0043,25500,25050,Le Bélieu,25,,,25050000AD0058,,,,,,,,,,,,,0,3,Dépendance,,0,S,sols,,,500,6.643493,47.112464
2020-293776,2020-06-18,000001,Vente,456000,,,CHE DES MARAIS,0043,25500,25050,Le Bélieu,25,,,25050000AD0058,,,,,,,,,,,,,0,3,Dépendance,,0,T,terres,,,3327,6.643493,47.112464
2020-293776,2020-06-18,000001,Vente,456000,,,CHAMP RIGEAI,B016,25500,25050,Le Bélieu,25,,,250500000B0183,,,,,,,,,,,,,0,,,,,BR,futaies résineuses,,,3570,6.644874,47.10977
2020-293795,2020-06-18,000001,Vente,360000,12,,RUE DES DOLINES,0025,25500,25050,Le Bélieu,25,,,25050000AE0065,,,,,,,,,,,,,0,4,Local industriel. commercial ou assimilé,323,0,AB,terrains a bâtir,,,2570,6.625489,47.105408
2020-294453,2020-09-02,000001,Vente,367970,3,,LE VAL BRUCHON,0059,25500,25050,Le Bélieu,25,,,250500000A0034,,,,,,,,,,,,,0,1,Maison,221,5,S,sols,,,265,6.630877,47.143468
2020-294453,2020-09-02,000001,Vente,367970,,,LE VAL DE BRUCHON,B122,25500,25050,Le Bélieu,25,,,250500000A0438,,,,,,,,,,,,,0,,,,,S,sols,,,2105,6.631427,47.143463
2020-294453,2020-09-02,000001,Vente,367970,,,LE VAL DE BRUCHON,B122,25500,25050,Le Bélieu,25,,,250500000A0440,,,,,,,,,,,,,0,,,,,T,terres,,,130,6.631295,47.14332
2020-294453,2020-09-02,000001,Vente,367970,,,PRE BIDEAU,B093,25500,25050,Le Bélieu,25,,,250500000A0442,,,,,,,,,,,,,0,,,,,T,terres,,,1321,6.631067,47.143684
2020-294938,2020-10-17,000001,Vente,160000,1,,FONTAINE DE LEUGNEY,0029,25500,25050,Le Bélieu,25,,,25050000AC0052,,,,,,,,,,,,,0,1,Maison,167,4,S,sols,,,1247,6.63946,47.120508
2020-294948,2020-10-27,000001,Vente,23726.16,,,LE VAL DE BRUCHON,B122,25500,25050,Le Bélieu,25,,,250500000A0040,,,,,,,,,,,,,0,,,,,T,terres,,,46040,6.633482,47.143113
2020-294948,2020-10-27,000001,Vente,23726.16,,,LE VAL DE BRUCHON,B122,25500,25050,Le Bélieu,25,,,250500000A0313,,,,,,,,,,,,,0,,,,,T,terres,,,8870,6.635875,47.142099
2020-294948,2020-10-27,000001,Vente,23726.16,,,LE VAL DE BRUCHON,B122,25500,25050,Le Bélieu,25,,,250500000A0313,,,,,,,,,,,,,0,,,,,T,terres,,,8870,6.635875,47.142099
