id_mutation,date_mutation,numero_disposition,nature_mutation,valeur_fonciere,adresse_numero,adresse_suffixe,adresse_nom_voie,adresse_code_voie,code_postal,code_commune,nom_commune,code_departement,ancien_code_commune,ancien_nom_commune,id_parcelle,ancien_id_parcelle,numero_volume,lot1_numero,lot1_surface_carrez,lot2_numero,lot2_surface_carrez,lot3_numero,lot3_surface_carrez,lot4_numero,lot4_surface_carrez,lot5_numero,lot5_surface_carrez,nombre_lots,code_type_local,type_local,surface_reelle_bati,nombre_pieces_principales,code_nature_culture,nature_culture,code_nature_culture_speciale,nature_culture_speciale,surface_terrain,longitude,latitude
2020-292905,2020-01-22,000001,Vente,3300,,,CHAMPS DE ROUGEUX,B018,25150,25216,Écurcey,25,,,25216000AC0105,,,,,,,,,,,,,0,,,,,T,terres,,,11215,6.806487,47.408285
2020-292905,2020-01-22,000001,Vente,3300,,,CHAMPS DE ROUGEUX,B018,25150,25216,Écurcey,25,,,25216000AC0106,,,,,,,,,,,,,0,,,,,L,landes,,,1190,6.806389,47.408397
2020-292953,2020-01-23,000001,Vente,246202,,,AU VILLAGE,B108,25150,25216,Écurcey,25,,,25216000AB0099,,,,,,,,,,,,,0,,,,,S,sols,,,390,6.812666,47.404367
2020-292953,2020-01-23,000001,Vente,246202,,,AUX GRAVIERS,B065,25150,25216,Écurcey,25,,,252160000B0300,,,,,,,,,,,,,0,,,,,J,jardins,,,45,6.81298,47.404232
2020-292953,2020-01-23,000001,Vente,246202,3,,RUE DE LA FONTAINE,0020,25150,25216,Écurcey,25,,,252160000B0303,,,,,,,,,,,,,0,1,Maison,84,4,S,sols,,,555,6.812855,47.404299
2020-293422,2020-04-15,000001,Vente,6600,,,COTE DE MONTANDRET,B032,25150,25216,Écurcey,25,,,252160000A0030,,,,,,,,,,,,,0,,,,,BS,taillis sous futaie,,,10070,6.825894,47.417761
2020-293707,2020-05-26,000001,Vente,101000,,,SOUS LA COTE,B096,25150,25216,Écurcey,25,,,25216000AH0265,,,,,,,,,,,,,0,,,,,VE,vergers,,,1440,6.779485,47.38882
2020-293707,2020-05-26,000001,Vente,101000,1,A,RUE DU STADE,0100,25150,25216,Écurcey,25,,,25216000AH0267,,,,,,,,,,,,,0,3,Dépendance,,0,S,sols,,,757,6.779246,47.388669
2020-293707,2020-05-26,000001,Vente,101000,1,A,RUE DU STADE,0100,25150,25216,Écurcey,25,,,25216000AH0267,,,,,,,,,,,,,0,3,Dépendance,,0,S,sols,,,757,6.779246,47.388669
2020-293707,2020-05-26,000001,Vente,101000,1,A,RUE DU STADE,0100,25150,25216,Écurcey,25,,,25216000AH0267,,,,,,,,,,,,,0,2,Appartement,65,3,S,sols,,,757,6.779246,47.388669
2020-293707,2020-05-26,000001,Vente,101000,1,A,RUE DU STADE,0100,25150,25216,Écurcey,25,,,25216000AH0267,,,,,,,,,,,,,0,2,Appartement,69,4,S,sols,,,757,6.779246,47.388669
2020-294094,2020-06-30,000002,Echange,150,,,AU VILLAGE,B108,25150,25216,Écurcey,25,,,25216000AB0205,,,,,,,,,,,,,0,,,,,VE,vergers,,,2,6.811387,47.405763
2020-294094,2020-06-30,000002,Echange,150,,,AU VILLAGE,B108,25150,25216,Écurcey,25,,,25216000AB0206,,,,,,,,,,,,,0,,,,,VE,vergers,,,8,6.811286,47.405589
2020-294094,2020-06-30,000003,Echange,150,,,AU VILLAGE,B108,25150,25216,Écurcey,25,,,25216000AB0208,,,,,,,,,,,,,0,,,,,VE,vergers,,,14,6.811345,47.405701
2020-294094,2020-06-30,000003,Echange,150,,,AU VILLAGE,B108,25150,25216,Écurcey,25,,,25216000AB0209,,,,,,,,,,,,,0,,,,,VE,vergers,,,4,6.811228,47.405542
2020-294133,2020-06-30,000001,Vente,60000,1,,RUE DES TILLEULS,0106,25150,25216,Écurcey,25,,,25216000AB0018,,,,,,,,,,,,,0,1,Maison,88,4,S,sols,,,320,6.811249,47.405437
2020-294133,2020-06-30,000001,Vente,60000,,,AU VILLAGE,B108,25150,25216,Écurcey,25,,,25216000AB0205,,,,,,,,,,,,,0,,,,,VE,vergers,,,2,6.811387,47.405763
2020-294133,2020-06-30,000001,Vente,60000,,,AU VILLAGE,B108,25150,25216,Écurcey,25,,,25216000AB0206,,,,,,,,,,,,,0,,,,,VE,vergers,,,8,6.811286,47.405589
2020-294133,2020-06-30,000001,Vente,60000,,,AU VILLAGE,B108,25150,25216,Écurcey,25,,,25216000AB0207,,,,,,,,,,,,,0,,,,,VE,vergers,,,238,6.811358,47.405643
