id_mutation,date_mutation,numero_disposition,nature_mutation,valeur_fonciere,adresse_numero,adresse_suffixe,adresse_nom_voie,adresse_code_voie,code_postal,code_commune,nom_commune,code_departement,ancien_code_commune,ancien_nom_commune,id_parcelle,ancien_id_parcelle,numero_volume,lot1_numero,lot1_surface_carrez,lot2_numero,lot2_surface_carrez,lot3_numero,lot3_surface_carrez,lot4_numero,lot4_surface_carrez,lot5_numero,lot5_surface_carrez,nombre_lots,code_type_local,type_local,surface_reelle_bati,nombre_pieces_principales,code_nature_culture,nature_culture,code_nature_culture_speciale,nature_culture_speciale,surface_terrain,longitude,latitude
2020-283893,2020-01-06,000001,Vente,234000,7,,RUE DE BANNE,0010,25170,25317,Jallerange,25,,,253170000D0393,,,,,,,,,,,,,0,1,Maison,176,7,S,sols,,,1335,5.714326,47.254155
2020-284164,2020-01-20,000001,Vente,173700,3,,RUE DU CENTRE,0014,25170,25317,Jallerange,25,,,253170000D0343,,,,,,,,,,,,,0,1,Maison,100,4,S,sols,,,448,5.716266,47.254041
2020-284164,2020-01-20,000001,Vente,173700,3,,RUE DU CENTRE,0014,25170,25317,Jallerange,25,,,253170000D0386,,,,,,,,,,,,,0,3,Dépendance,,0,S,sols,,,102,5.716475,47.253933
2020-284164,2020-01-20,000001,Vente,173700,,,AU VILLAGE,B281,25170,25317,Jallerange,25,,,253170000D0387,,,,,,,,,,,,,0,,,,,S,sols,,,280,5.716284,47.254191
2020-284960,2020-03-11,000001,Vente,201000,13,,RUE DE BANNE,0010,25170,25317,Jallerange,25,,,25317000ZN0072,,,,,,,,,,,,,0,1,Maison,99,5,S,sols,,,901,5.712993,47.254492
2020-284960,2020-03-11,000001,Vente,201000,13,,RUE DE BANNE,0010,25170,25317,Jallerange,25,,,25317000ZN0072,,,,,,,,,,,,,0,1,Maison,99,5,AG,terrains d'agrément,PARC,Parc,2000,5.712993,47.254492
2020-285381,2020-05-29,000001,Vente,500,,,CHAMPBAUCHIER,B029,25170,25317,Jallerange,25,,,25317000ZL0021,,,,,,,,,,,,,0,,,,,P,prés,,,485,5.730175,47.263817
2020-285918,2020-06-25,000001,Vente,49000,,,SOUS VAUDRY,B252,25170,25317,Jallerange,25,,,25317000ZM0134,,,,,,,,,,,,,0,,,,,T,terres,,,726,5.721435,47.25359
2020-286351,2020-07-10,000003,Echange,1593,,,AUX MAIX,B164,25170,25317,Jallerange,25,,,253170000D0455,,,,,,,,,,,,,0,,,,,L,landes,FRICH,Friche,32,5.718131,47.254231
2020-286351,2020-07-10,000003,Echange,1593,,,DERRIERE LA FORGE,B114,25170,25317,Jallerange,25,,,253170000D0461,,,,,,,,,,,,,0,,,,,S,sols,,,112,5.719131,47.254301
2020-286351,2020-07-10,000003,Echange,1593,,,SOUS VAUDRY,B252,25170,25317,Jallerange,25,,,25317000ZM0122,,,,,,,,,,,,,0,,,,,T,terres,,,91,5.719433,47.25406
2020-286352,2020-07-10,000004,Echange,1193,,,DERRIERE LA FORGE,B114,25170,25317,Jallerange,25,,,253170000D0153,,,,,,,,,,,,,0,,,,,S,sols,,,50,5.719023,47.254287
2020-286352,2020-07-10,000004,Echange,1193,,,DERRIERE LA FORGE,B114,25170,25317,Jallerange,25,,,253170000D0460,,,,,,,,,,,,,0,,,,,P,prés,,,126,5.719049,47.254204
2020-287997,2020-11-05,000001,Vente,56000,,,SOUS VAUDRY,B252,25170,25317,Jallerange,25,,,25317000ZM0132,,,,,,,,,,,,,0,,,,,AB,terrains a bâtir,,,799,5.721653,47.253142
