id_mutation,date_mutation,numero_disposition,nature_mutation,valeur_fonciere,adresse_numero,adresse_suffixe,adresse_nom_voie,adresse_code_voie,code_postal,code_commune,nom_commune,code_departement,ancien_code_commune,ancien_nom_commune,id_parcelle,ancien_id_parcelle,numero_volume,lot1_numero,lot1_surface_carrez,lot2_numero,lot2_surface_carrez,lot3_numero,lot3_surface_carrez,lot4_numero,lot4_surface_carrez,lot5_numero,lot5_surface_carrez,nombre_lots,code_type_local,type_local,surface_reelle_bati,nombre_pieces_principales,code_nature_culture,nature_culture,code_nature_culture_speciale,nature_culture_speciale,surface_terrain,longitude,latitude
2020-285739,2020-06-16,000001,Vente,95000,,,AU VILLAGE,B026,25680,25556,Tallans,25,,,255560000B0084,,,,,,,,,,,,,0,,,,,BT,taillis simples,,,80,6.289655,47.421914
2020-285739,2020-06-16,000001,Vente,95000,5,,RUE DE LA SOURCE,0014,25680,25556,Tallans,25,,,255560000B0085,,,,,,,,,,,,,0,1,Maison,70,3,S,sols,,,245,6.289564,47.421748
2020-285739,2020-06-16,000001,Vente,95000,,,AU VILLAGE,B026,25680,25556,Tallans,25,,,255560000B0088,,,,,,,,,,,,,0,,,,,L,landes,,,750,6.289878,47.421778
2020-285739,2020-06-16,000001,Vente,95000,,,LE CLOS,B008,25680,25556,Tallans,25,,,25556000ZA0080,,,,,,,,,,,,,0,,,,,P,prés,,,632,6.289513,47.421875
2020-285926,2020-07-01,000001,Vente,200000,2,,RUE DE LA SOURCE,0014,25680,25556,Tallans,25,,,255560000B0254,,,,,,,,,,,,,0,1,Maison,100,3,S,sols,,,569,6.288447,47.420394
2020-285926,2020-07-01,000001,Vente,200000,2,,RUE DE LA SOURCE,0014,25680,25556,Tallans,25,,,255560000B0254,,,,,,,,,,,,,0,2,Appartement,146,5,S,sols,,,569,6.288447,47.420394
2020-285926,2020-07-01,000001,Vente,200000,2,,RUE DE LA SOURCE,0014,25680,25556,Tallans,25,,,255560000B0254,,,,,,,,,,,,,0,3,Dépendance,,0,S,sols,,,569,6.288447,47.420394
2020-285926,2020-07-01,000001,Vente,200000,2,,RUE DE LA SOURCE,0014,25680,25556,Tallans,25,,,255560000B0254,,,,,,,,,,,,,0,2,Appartement,100,4,S,sols,,,569,6.288447,47.420394
2020-285926,2020-07-01,000001,Vente,200000,2,,RUE DE LA SOURCE,0014,25680,25556,Tallans,25,,,255560000B0254,,,,,,,,,,,,,0,3,Dépendance,,0,S,sols,,,569,6.288447,47.420394
2020-286788,2020-08-21,000001,Vente,100000,,,LES ILES MARAUX,B019,25680,25556,Tallans,25,,,255560000B0242,,,,,,,,,,,,,0,,,,,BR,futaies résineuses,EPICE,Epicéas,74468,6.280443,47.417187
