id_mutation,date_mutation,numero_disposition,nature_mutation,valeur_fonciere,adresse_numero,adresse_suffixe,adresse_nom_voie,adresse_code_voie,code_postal,code_commune,nom_commune,code_departement,ancien_code_commune,ancien_nom_commune,id_parcelle,ancien_id_parcelle,numero_volume,lot1_numero,lot1_surface_carrez,lot2_numero,lot2_surface_carrez,lot3_numero,lot3_surface_carrez,lot4_numero,lot4_surface_carrez,lot5_numero,lot5_surface_carrez,nombre_lots,code_type_local,type_local,surface_reelle_bati,nombre_pieces_principales,code_nature_culture,nature_culture,code_nature_culture_speciale,nature_culture_speciale,surface_terrain,longitude,latitude
2020-285986,2020-06-29,000001,Vente,258200,40,,LOT LES VAUCIELS,A060,25870,25557,Tallenay,25,,,25557000ZA0192,,,,,,,,,,,,,0,1,Maison,120,5,S,sols,,,434,6.018707,47.30695
2020-285986,2020-06-29,000001,Vente,258200,40,,LOT LES VAUCIELS,A060,25870,25557,Tallenay,25,,,25557000ZA0192,,,,,,,,,,,,,0,1,Maison,120,5,AG,terrains d'agrément,,,1141,6.018707,47.30695
2020-287132,2020-09-15,000001,Vente,382000,5118,,SOUS LA ROCHE,B022,25870,25557,Tallenay,25,,,25557000ZA0067,,,,,,,,,,,,,0,1,Maison,178,8,AG,terrains d'agrément,,,2750,6.027538,47.304618
2020-287132,2020-09-15,000001,Vente,382000,5118,,SOUS LA ROCHE,B022,25870,25557,Tallenay,25,,,25557000ZA0067,,,,,,,,,,,,,0,3,Dépendance,,0,AG,terrains d'agrément,,,2750,6.027538,47.304618
2020-287132,2020-09-15,000001,Vente,382000,5118,,SOUS LA ROCHE,B022,25870,25557,Tallenay,25,,,25557000ZA0067,,,,,,,,,,,,,0,1,Maison,178,8,S,sols,,,500,6.027538,47.304618
2020-287132,2020-09-15,000001,Vente,382000,5118,,SOUS LA ROCHE,B022,25870,25557,Tallenay,25,,,25557000ZA0067,,,,,,,,,,,,,0,3,Dépendance,,0,S,sols,,,500,6.027538,47.304618
2020-287459,2020-09-30,000001,Vente,100,,,LONGUES RAIES,B017,25870,25557,Tallenay,25,,,25557000ZA0289,,,,,,,,,,,,,0,,,,,P,prés,,,490,6.025245,47.309703
2020-288422,2020-11-25,000001,Vente,652800,4,,VRETILLE,B026,25870,25557,Tallenay,25,,,25557000ZB0289,,,,,,,,,,,,,0,1,Maison,256,7,S,sols,,,1546,6.018461,47.306363
2020-288492,2020-12-11,000001,Vente,437800,2,B,RUE DU CHATEAU,0020,25870,25557,Tallenay,25,,,25557000AB0134,,,,,,,,,,,,,0,3,Dépendance,,0,S,sols,,,617,6.025487,47.305487
2020-288492,2020-12-11,000001,Vente,437800,2,B,RUE DU CHATEAU,0020,25870,25557,Tallenay,25,,,25557000AB0134,,,,,,,,,,,,,0,1,Maison,121,6,S,sols,,,617,6.025487,47.305487
