id_mutation,date_mutation,numero_disposition,nature_mutation,valeur_fonciere,adresse_numero,adresse_suffixe,adresse_nom_voie,adresse_code_voie,code_postal,code_commune,nom_commune,code_departement,ancien_code_commune,ancien_nom_commune,id_parcelle,ancien_id_parcelle,numero_volume,lot1_numero,lot1_surface_carrez,lot2_numero,lot2_surface_carrez,lot3_numero,lot3_surface_carrez,lot4_numero,lot4_surface_carrez,lot5_numero,lot5_surface_carrez,nombre_lots,code_type_local,type_local,surface_reelle_bati,nombre_pieces_principales,code_nature_culture,nature_culture,code_nature_culture_speciale,nature_culture_speciale,surface_terrain,longitude,latitude
2020-324392,2020-01-08,000001,Vente,90000,12,,RUE ST PIERRE,0050,28800,28259,Montboissier,28,,,28259000AI0012,,,,,,,,,,,,,0,1,Maison,90,3,AG,terrains d'agrément,,,780,1.429843,48.242765
2020-324392,2020-01-08,000001,Vente,90000,12,,RUE ST PIERRE,0050,28800,28259,Montboissier,28,,,28259000AI0012,,,,,,,,,,,,,0,1,Maison,90,3,S,sols,,,547,1.429843,48.242765
2020-324441,2020-02-01,000001,Vente,75250,1,,RUE DE LA VALLEE AUX FRENES,0060,28800,28259,Montboissier,28,,,28259000AH0004,,,,,,,,,,,,,0,1,Maison,92,4,S,sols,,,2515,1.411702,48.232506
2020-324685,2020-04-16,000001,Vente,166250,4,,RUE DES TILLEULS,0058,28800,28259,Montboissier,28,,,28259000AE0029,,,,,,,,,,,,,0,1,Maison,85,4,J,jardins,,,488,1.406754,48.209086
2020-324685,2020-04-16,000001,Vente,166250,4,,RUE DES TILLEULS,0058,28800,28259,Montboissier,28,,,28259000AE0029,,,,,,,,,,,,,0,1,Maison,85,4,S,sols,,,984,1.406754,48.209086
2020-325039,2020-07-23,000001,Vente,109000,26,,RUE DE LA VALLEE AUX FRENES,0060,28800,28259,Montboissier,28,,,28259000AH0029,,,,,,,,,,,,,0,1,Maison,102,4,J,jardins,,,464,1.413654,48.229883
2020-325039,2020-07-23,000001,Vente,109000,26,,RUE DE LA VALLEE AUX FRENES,0060,28800,28259,Montboissier,28,,,28259000AH0029,,,,,,,,,,,,,0,1,Maison,102,4,AG,terrains d'agrément,,,391,1.413654,48.229883
2020-325039,2020-07-23,000001,Vente,109000,26,,RUE DE LA VALLEE AUX FRENES,0060,28800,28259,Montboissier,28,,,28259000AH0029,,,,,,,,,,,,,0,1,Maison,102,4,S,sols,,,469,1.413654,48.229883
2020-325113,2020-08-18,000001,Vente,202000,,,MONTBOISSIER,B028,28800,28259,Montboissier,28,,,28259000AD0125,,,,,,,,,,,,,0,,,,,J,jardins,,,380,1.393593,48.221173
2020-325113,2020-08-18,000001,Vente,202000,3,B,RUE LES RUES NEUVES,0055,28800,28259,Montboissier,28,,,28259000AD0133,,,,,,,,,,,,,0,1,Maison,143,2,S,sols,,,925,1.393484,48.220968
2020-325113,2020-08-18,000001,Vente,202000,,,MONTBOISSIER,B028,28800,28259,Montboissier,28,,,28259000AD0139,,,,,,,,,,,,,0,,,,,T,terres,,,75,1.393986,48.220971
2020-325113,2020-08-18,000001,Vente,202000,,,MONTBOISSIER,B028,28800,28259,Montboissier,28,,,28259000AD0142,,,,,,,,,,,,,0,,,,,J,jardins,,,298,1.393983,48.221076
2020-325113,2020-08-18,000001,Vente,202000,3,,RUE LES RUES NEUVES,0055,28800,28259,Montboissier,28,,,28259000AD0143,,,,,,,,,,,,,0,,,,,S,sols,,,241,1.393892,48.22095
2020-325139,2020-09-11,000001,Vente,187950,22,,RUE DU HOUSSAY,0024,28800,28259,Montboissier,28,,,28259000AD0073,,,,,,,,,,,,,0,1,Maison,205,7,S,sols,,,634,1.392583,48.220335
2020-325139,2020-09-11,000001,Vente,187950,22,,RUE DU HOUSSAY,0024,28800,28259,Montboissier,28,,,28259000AD0073,,,,,,,,,,,,,0,1,Maison,205,7,J,jardins,,,812,1.392583,48.220335
2020-325139,2020-09-11,000001,Vente,187950,,,RUE DU HOUSSAY,0024,28800,28259,Montboissier,28,,,28259000AD0074,,,,,,,,,,,,,0,,,,,S,sols,,,314,1.392453,48.220256
2020-325266,2020-09-29,000001,Vente,156501,,,LA PORTE DES CHAMPS,B037,28800,28259,Montboissier,28,,,28259000ZC0008,,,,,,,,,,,,,0,,,,,T,terres,,,4500,1.434286,48.246025
2020-325266,2020-09-29,000001,Vente,156501,,,LA PORTE DES CHAMPS,B037,28800,28259,Montboissier,28,,,28259000ZC0008,,,,,,,,,,,,,0,,,,,T,terres,,,13500,1.434286,48.246025
2020-325266,2020-09-29,000001,Vente,156501,,,LA PORTE DES CHAMPS,B037,28800,28259,Montboissier,28,,,28259000ZC0010,,,,,,,,,,,,,0,,,,,T,terres,,,4965,1.438712,48.244387
2020-325266,2020-09-29,000001,Vente,156501,,,LA PORTE DES CHAMPS,B037,28800,28259,Montboissier,28,,,28259000ZC0011,,,,,,,,,,,,,0,,,,,T,terres,,,10095,1.439042,48.244035
2020-325266,2020-09-29,000001,Vente,156501,,,LA PORTE DES CHAMPS,B037,28800,28259,Montboissier,28,,,28259000ZC0012,,,,,,,,,,,,,0,,,,,T,terres,,,21980,1.439519,48.242951
2020-325266,2020-09-29,000001,Vente,156501,,,LA PORTE DES CHAMPS,B037,28800,28259,Montboissier,28,,,28259000ZC0025,,,,,,,,,,,,,0,,,,,T,terres,,,3628,1.432864,48.244274
2020-325266,2020-09-29,000001,Vente,156501,,,LA PORTE DES CHAMPS,B037,28800,28259,Montboissier,28,,,28259000ZC0025,,,,,,,,,,,,,0,,,,,T,terres,,,1814,1.432864,48.244274
2020-325266,2020-09-29,000001,Vente,156501,,,THIRON,B042,28800,28259,Montboissier,28,,,28259000ZC0039,,,,,,,,,,,,,0,,,,,T,terres,,,16041,1.438488,48.239909
2020-325266,2020-09-29,000001,Vente,156501,,,LES GRELETS,B022,28800,28259,Montboissier,28,,,28259000ZC0076,,,,,,,,,,,,,0,,,,,T,terres,,,23929,1.434147,48.237594
2020-325266,2020-09-29,000001,Vente,156501,,,LES GRELETS,B022,28800,28259,Montboissier,28,,,28259000ZC0076,,,,,,,,,,,,,0,,,,,T,terres,,,1949,1.434147,48.237594
