id_mutation,date_mutation,numero_disposition,nature_mutation,valeur_fonciere,adresse_numero,adresse_suffixe,adresse_nom_voie,adresse_code_voie,code_postal,code_commune,nom_commune,code_departement,ancien_code_commune,ancien_nom_commune,id_parcelle,ancien_id_parcelle,numero_volume,lot1_numero,lot1_surface_carrez,lot2_numero,lot2_surface_carrez,lot3_numero,lot3_surface_carrez,lot4_numero,lot4_surface_carrez,lot5_numero,lot5_surface_carrez,nombre_lots,code_type_local,type_local,surface_reelle_bati,nombre_pieces_principales,code_nature_culture,nature_culture,code_nature_culture_speciale,nature_culture_speciale,surface_terrain,longitude,latitude
2020-325783,2020-01-21,000001,Vente,283500,8,,RUE DE VILLEMEUX,0186,28210,28289,Ormoy,28,,,282890000A0058,,,,,,,,,,,,,0,1,Maison,171,5,S,sols,,,810,1.472188,48.623579
2020-325783,2020-01-21,000001,Vente,283500,,,ORMOY,B020,28210,28289,Ormoy,28,,,282890000A0570,,,,,,,,,,,,,0,,,,,J,jardins,,,63,1.472276,48.623769
2020-325783,2020-01-21,000001,Vente,283500,,,ORMOY,B020,28210,28289,Ormoy,28,,,282890000A0572,,,,,,,,,,,,,0,,,,,J,jardins,,,118,1.472437,48.623676
2020-326009,2020-02-12,000001,Vente,237100,6,,RUE DE VILLEMEUX,0186,28210,28289,Ormoy,28,,,282890000A0436,,,,,,,,,,,,,0,1,Maison,120,4,S,sols,,,1588,1.472524,48.62347
2020-326009,2020-02-12,000001,Vente,237100,6,,RUE DE VILLEMEUX,0186,28210,28289,Ormoy,28,,,282890000A0436,,,,,,,,,,,,,0,1,Maison,120,4,J,jardins,,,500,1.472524,48.62347
2020-326012,2020-02-14,000001,Vente,180300,8,,RUE DES FORGES,0162,28210,28289,Ormoy,28,,,282890000A0447,,,,,,,,,,,,,0,1,Maison,70,3,S,sols,,,729,1.47359,48.62267
2020-326012,2020-02-14,000001,Vente,180300,,,ORMOY,B020,28210,28289,Ormoy,28,,,282890000A0465,,,,,,,,,,,,,0,,,,,AB,terrains a bâtir,,,794,1.473602,48.622465
2020-326632,2020-06-12,000001,Vente,216000,3,,RUE DE BOULLAY THIERRY,0142,28210,28289,Ormoy,28,,,282890000A0554,,,,,,,,,,,,,0,1,Maison,140,8,S,sols,,,548,1.468666,48.62085
2020-326632,2020-06-12,000001,Vente,216000,,,ORMOY,B020,28210,28289,Ormoy,28,,,282890000A0556,,,,,,,,,,,,,0,,,,,AB,terrains a bâtir,,,708,1.468572,48.620673
2020-326650,2020-06-02,000001,Vente,40000,,,LA DIMERIE,B012,28210,28289,Ormoy,28,,,28289000ZL0026,,,,,,,,,,,,,0,,,,,AB,terrains a bâtir,,,1260,1.474601,48.624268
2020-327302,2020-08-21,000001,Vente,25000,,,LA VIGNE,B026,28210,28289,Ormoy,28,,,28289000ZE0004,,,,,,,,,,,,,0,,,,,T,terres,,,12500,1.467949,48.615167
2020-327302,2020-08-21,000001,Vente,25000,,,LES TREAIES,B023,28210,28289,Ormoy,28,,,28289000ZN0006,,,,,,,,,,,,,0,,,,,T,terres,,,29950,1.467104,48.618098
2020-327758,2020-10-30,000001,Vente,132500,6,,RUE DE LA PLAINE,0032,28210,28289,Ormoy,28,,,28289000ZH0108,,,,,,,,,,,,,0,1,Maison,82,5,S,sols,,,1127,1.466323,48.610215
