id_mutation,date_mutation,numero_disposition,nature_mutation,valeur_fonciere,adresse_numero,adresse_suffixe,adresse_nom_voie,adresse_code_voie,code_postal,code_commune,nom_commune,code_departement,ancien_code_commune,ancien_nom_commune,id_parcelle,ancien_id_parcelle,numero_volume,lot1_numero,lot1_surface_carrez,lot2_numero,lot2_surface_carrez,lot3_numero,lot3_surface_carrez,lot4_numero,lot4_surface_carrez,lot5_numero,lot5_surface_carrez,nombre_lots,code_type_local,type_local,surface_reelle_bati,nombre_pieces_principales,code_nature_culture,nature_culture,code_nature_culture_speciale,nature_culture_speciale,surface_terrain,longitude,latitude
2020-325802,2020-01-11,000001,Vente,35000,,,TORCAY,B070,28170,28323,Saint-Ange-et-Torçay,28,,,28323000ZN0211,,,,,,,,,,,,,0,,,,,AB,terrains a bâtir,,,634,1.226589,48.63822
2020-325802,2020-01-11,000001,Vente,35000,1,,RUE DE LA MAIRIE,0120,28170,28323,Saint-Ange-et-Torçay,28,,,28323000ZN0213,,,,,,,,,,,,,0,,,,,J,jardins,,,702,1.226193,48.638234
2020-325802,2020-01-11,000001,Vente,35000,,,RUE DE LA MAIRIE,0120,28170,28323,Saint-Ange-et-Torçay,28,,,28323000ZN0214,,,,,,,,,,,,,0,,,,,S,sols,,,213,1.22637,48.638248
2020-327250,2020-09-10,000001,Vente,175690,,,TORCAY,B070,28170,28323,Saint-Ange-et-Torçay,28,,,28323000ZN0048,,,,,,,,,,,,,0,,,,,J,jardins,,,563,1.224895,48.636196
2020-327250,2020-09-10,000001,Vente,175690,,,TORCAY,B070,28170,28323,Saint-Ange-et-Torçay,28,,,28323000ZN0127,,,,,,,,,,,,,0,,,,,AB,terrains a bâtir,,,71,1.224615,48.636238
2020-327250,2020-09-10,000001,Vente,175690,3,,RUE DU BAS DES CLOS,0010,28170,28323,Saint-Ange-et-Torçay,28,,,28323000ZN0184,,,,,,,,,,,,,0,1,Maison,65,2,S,sols,,,573,1.224833,48.636368
2020-327250,2020-09-10,000001,Vente,175690,3,,RUE DU BAS DES CLOS,0010,28170,28323,Saint-Ange-et-Torçay,28,,,28323000ZN0185,,,,,,,,,,,,,0,,,,,S,sols,,,24,1.22499,48.636152
2020-327663,2020-09-21,000001,Vente,426400,,,TORCAY,B070,28170,28323,Saint-Ange-et-Torçay,28,,,28323000ZP0106,,,,,,,,,,,,,0,,,,,T,terres,,,2575,1.225051,48.639279
2020-327663,2020-09-21,000001,Vente,426400,25,,TORCAY,B070,28170,28323,Saint-Ange-et-Torçay,28,,,28323000ZP0107,,,,,,,,,,,,,0,1,Maison,199,8,S,sols,,,1247,1.225618,48.639033
