id_mutation,date_mutation,numero_disposition,nature_mutation,valeur_fonciere,adresse_numero,adresse_suffixe,adresse_nom_voie,adresse_code_voie,code_postal,code_commune,nom_commune,code_departement,ancien_code_commune,ancien_nom_commune,id_parcelle,ancien_id_parcelle,numero_volume,lot1_numero,lot1_surface_carrez,lot2_numero,lot2_surface_carrez,lot3_numero,lot3_surface_carrez,lot4_numero,lot4_surface_carrez,lot5_numero,lot5_surface_carrez,nombre_lots,code_type_local,type_local,surface_reelle_bati,nombre_pieces_principales,code_nature_culture,nature_culture,code_nature_culture_speciale,nature_culture_speciale,surface_terrain,longitude,latitude
2020-344092,2020-09-18,000001,Vente,89500,159,,KERFORNIOU,B798,29640,29114,Lannéanou,29,,,291140000D0485,,,,,,,,,,,,,0,1,Maison,157,3,S,sols,,,70,-3.645743,48.490015
2020-344092,2020-09-18,000001,Vente,89500,,,KERFORNIOU,B798,29640,29114,Lannéanou,29,,,291140000D0580,,,,,,,,,,,,,0,,,,,S,sols,,,20,-3.645899,48.490058
2020-344092,2020-09-18,000001,Vente,89500,,,KERFORNIOU,B798,29640,29114,Lannéanou,29,,,291140000D0722,,,,,,,,,,,,,0,,,,,S,sols,,,45,-3.64574,48.489944
2020-344092,2020-09-18,000001,Vente,89500,,,KERFORNIOU JARDIN BIHAN,B836,29640,29114,Lannéanou,29,,,291140000D0873,,,,,,,,,,,,,0,,,,,J,jardins,,,545,-3.646022,48.49019
2020-345327,2020-10-24,000001,Vente,190000,179,,GRAND HUGEN,B467,29640,29114,Lannéanou,29,,,291140000E0296,,,,,,,,,,,,,0,1,Maison,224,4,S,sols,,,1035,-3.664821,48.472403
2020-345327,2020-10-24,000001,Vente,190000,,,GRAND HUGEN LIORS AR LEUR,B503,29640,29114,Lannéanou,29,,,291140000E0297,,,,,,,,,,,,,0,,,,,T,terres,,,1259,-3.664453,48.472298
2020-345327,2020-10-24,000001,Vente,190000,,,GRAND HUGEN VERGER VIAN,B595,29640,29114,Lannéanou,29,,,291140000E0298,,,,,,,,,,,,,0,,,,,VE,vergers,,,290,-3.664462,48.472028
2020-345327,2020-10-24,000001,Vente,190000,,,GRAND HUGEN,B467,29640,29114,Lannéanou,29,,,291140000E0465,,,,,,,,,,,,,0,,,,,S,sols,,,472,-3.664662,48.472222
2020-345327,2020-10-24,000001,Vente,190000,,,GRAND HUGEN,B467,29640,29114,Lannéanou,29,,,291140000E0466,,,,,,,,,,,,,0,,,,,T,terres,,,73,-3.664567,48.472537
2020-345327,2020-10-24,000001,Vente,190000,,,GRAND HUGEN LIORS AR LEUR,B503,29640,29114,Lannéanou,29,,,291140000E0467,,,,,,,,,,,,,0,,,,,T,terres,,,45,-3.664586,48.472632
2020-345327,2020-10-24,000001,Vente,190000,,,GRAND HUGEN VERGER AR PORS,B594,29640,29114,Lannéanou,29,,,291140000E0508,,,,,,,,,,,,,0,,,,,VE,vergers,,,1232,-3.665094,48.472264
2020-345327,2020-10-24,000001,Vente,190000,,,GRAND HUGEN VERGER AN TY,B591,29640,29114,Lannéanou,29,,,291140000E0509,,,,,,,,,,,,,0,,,,,VE,vergers,,,2598,-3.664973,48.472663
2020-345622,2020-10-27,000001,Vente,62000,21,,RUE DES MARAIS,0320,29640,29114,Lannéanou,29,,,291140000D0124,,,,,,,,,,,,,0,1,Maison,144,5,S,sols,,,780,-3.670172,48.4872
2020-345622,2020-10-27,000001,Vente,62000,,,LE BOURG D ANECH,B039,29640,29114,Lannéanou,29,,,291140000D0125,,,,,,,,,,,,,0,,,,,T,terres,,,3310,-3.66963,48.487352
2020-345914,2020-11-13,000001,Vente,134500,12,,RUE ALPHONSE RAZER,0002,29640,29114,Lannéanou,29,,,291140000C0428,,,,,,,,,,,,,0,1,Maison,99,5,S,sols,,,408,-3.673561,48.48963
2020-345914,2020-11-13,000001,Vente,134500,,,LE BOURG PARC AR BIC,B063,29640,29114,Lannéanou,29,,,291140000C0504,,,,,,,,,,,,,0,,,,,T,terres,,,231,-3.673653,48.489738
2020-347002,2020-12-04,000001,Vente,45000,,,LE BOURG GOAREM VIAN,B049,29640,29114,Lannéanou,29,,,291140000D0148,,,,,,,,,,,,,0,,,,,T,terres,,,6531,-3.66611,48.488193
2020-347131,2020-12-01,000001,Vente,90000,,,GOLOT VIAN COAT AR ROZ,B447,29640,29114,Lannéanou,29,,,291140000D0395,,,,,,,,,,,,,0,,,,,BT,taillis simples,,,3190,-3.644838,48.498248
2020-347131,2020-12-01,000001,Vente,90000,,,GOLOT VIAN AR ROZ,B446,29640,29114,Lannéanou,29,,,291140000D0396,,,,,,,,,,,,,0,,,,,T,terres,,,2980,-3.645369,48.497878
2020-347131,2020-12-01,000001,Vente,90000,148,,GOLOT VIAN,B444,29640,29114,Lannéanou,29,,,291140000D0397,,,,,,,,,,,,,0,3,Dépendance,,0,S,sols,,,28,-3.645726,48.498259
2020-347131,2020-12-01,000001,Vente,90000,148,,GOLOT VIAN,B444,29640,29114,Lannéanou,29,,,291140000D0397,,,,,,,,,,,,,0,1,Maison,112,5,S,sols,,,28,-3.645726,48.498259
2020-347131,2020-12-01,000001,Vente,90000,148,,GOLOT VIAN,B444,29640,29114,Lannéanou,29,,,291140000D0397,,,,,,,,,,,,,0,3,Dépendance,,0,S,sols,,,28,-3.645726,48.498259
2020-347131,2020-12-01,000001,Vente,90000,,,GOLOT VIAN PARC SAOUENNIC,B461,29640,29114,Lannéanou,29,,,291140000D0410,,,,,,,,,,,,,0,,,,,L,landes,,,5236,-3.644583,48.497514
2020-347131,2020-12-01,000001,Vente,90000,,,GOLOT VIAN,B444,29640,29114,Lannéanou,29,,,291140000D0636,,,,,,,,,,,,,0,,,,,S,sols,,,25,-3.645684,48.498199
2020-347131,2020-12-01,000001,Vente,90000,,,GOLOT VIAN AR ROZ,B446,29640,29114,Lannéanou,29,,,291140000D0637,,,,,,,,,,,,,0,,,,,T,terres,,,1730,-3.645461,48.498348
2020-347144,2020-12-05,000001,Vente,5349.5,8,,LOTISSEMENT PARK BRAZ,0350,29640,29114,Lannéanou,29,,,291140000D1040,,,,,,,,,,,,,0,,,,,AB,terrains a bâtir,,,823,-3.675236,48.486637
2020-348409,2020-12-11,000001,Vente,85000,5,,LOTISSEMENT PARK BRAZ,0350,29640,29114,Lannéanou,29,,,291140000D1036,,,,,,,,,,,,,0,1,Maison,58,3,S,sols,,,857,-3.675664,48.487082
2020-348628,2020-12-24,000001,Vente,6500,2,,IMP DE PORS AN TOUCH,0400,29640,29114,Lannéanou,29,,,291140000D0091,,,,,,,,,,,,,0,1,Maison,90,3,S,sols,,,54,-3.671529,48.488595
2020-348753,2020-12-31,000001,Vente,24000,,,LE BOURG,B025,29640,29114,Lannéanou,29,,,291140000D0775,,,,,,,,,,,,,0,,,,,T,terres,,,65,-3.674582,48.488517
2020-348753,2020-12-31,000001,Vente,24000,,,LE BOURG,B025,29640,29114,Lannéanou,29,,,291140000D1046,,,,,,,,,,,,,0,,,,,T,terres,,,491,-3.674223,48.4885
2020-348753,2020-12-31,000001,Vente,24000,,,LE BOURG,B025,29640,29114,Lannéanou,29,,,291140000D1046,,,,,,,,,,,,,0,,,,,T,terres,,,790,-3.674223,48.4885
2020-348753,2020-12-31,000001,Vente,24000,,,LE BOURG,B025,29640,29114,Lannéanou,29,,,291140000D1046,,,,,,,,,,,,,0,,,,,S,sols,,,144,-3.674223,48.4885
2020-348753,2020-12-31,000001,Vente,24000,,,LE BOURG PARC AR C HANTEC,B064,29640,29114,Lannéanou,29,,,291140000D1048,,,,,,,,,,,,,0,,,,,S,sols,,,14,-3.674539,48.488437
2020-353251,2020-01-30,000001,Vente,145000,7008,A,KERALVEZ,B687,29640,29114,Lannéanou,29,,,291140000D0566,,,,,,,,,,,,,0,1,Maison,139,6,T,terres,,,9878,-3.652743,48.486886
2020-353251,2020-01-30,000001,Vente,145000,7008,A,KERALVEZ,B687,29640,29114,Lannéanou,29,,,291140000D0566,,,,,,,,,,,,,0,1,Maison,139,6,AG,terrains d'agrément,,,1000,-3.652743,48.486886
2020-353251,2020-01-30,000001,Vente,145000,7008,A,KERALVEZ,B687,29640,29114,Lannéanou,29,,,291140000D0566,,,,,,,,,,,,,0,1,Maison,139,6,S,sols,,,500,-3.652743,48.486886
2020-353325,2020-01-31,000001,Vente,90351,1,,RUE DE BEL AIR,0003,29640,29114,Lannéanou,29,,,291140000D0699,,,,,,,,,,,,,0,3,Dépendance,,0,T,terres,,,2446,-3.670739,48.486197
2020-353325,2020-01-31,000001,Vente,90351,1,,RUE DE BEL AIR,0003,29640,29114,Lannéanou,29,,,291140000D0699,,,,,,,,,,,,,0,3,Dépendance,,0,S,sols,,,1114,-3.670739,48.486197
2020-353325,2020-01-31,000001,Vente,90351,1,,RUE DE BEL AIR,0003,29640,29114,Lannéanou,29,,,291140000D0699,,,,,,,,,,,,,0,1,Maison,72,3,S,sols,,,1114,-3.670739,48.486197
2020-353325,2020-01-31,000001,Vente,90351,1,,RUE DE BEL AIR,0003,29640,29114,Lannéanou,29,,,291140000D0699,,,,,,,,,,,,,0,1,Maison,72,3,T,terres,,,2446,-3.670739,48.486197
2020-353474,2020-02-27,000001,Vente,4000,,,CLEUNCOAT GOAREM AR FEUNTE,B230,29640,29114,Lannéanou,29,,,291140000D0344,,,,,,,,,,,,,0,,,,,T,terres,,,10900,-3.668273,48.483146
2020-353474,2020-02-27,000001,Vente,4000,,,CLEUNCOAT GOAREM AR FEUNTE,B230,29640,29114,Lannéanou,29,,,291140000D0344,,,,,,,,,,,,,0,,,,,L,landes,,,3467,-3.668273,48.483146
2020-354951,2020-07-31,000001,Vente,100000,,,KERLOSSER AR GOAREM BRAS,B936,29640,29114,Lannéanou,29,,,291140000A0364,,,,,,,,,,,,,0,,,,,T,terres,,,11265,-3.667612,48.514278
2020-354951,2020-07-31,000001,Vente,100000,,,KERLOSSER AR GOAREM BRAS,B936,29640,29114,Lannéanou,29,,,291140000A0365,,,,,,,,,,,,,0,,,,,T,terres,,,11125,-3.666974,48.513602
2020-354951,2020-07-31,000001,Vente,100000,,,KERLOSSER AR GOAREM IZELLA,B937,29640,29114,Lannéanou,29,,,291140000A0366,,,,,,,,,,,,,0,,,,,T,terres,,,8048,-3.666649,48.512398
2020-354951,2020-07-31,000001,Vente,100000,,,KERLOSSER AR GOAREM IZELLA,B937,29640,29114,Lannéanou,29,,,291140000A0366,,,,,,,,,,,,,0,,,,,BT,taillis simples,,,842,-3.666649,48.512398
2020-354951,2020-07-31,000001,Vente,100000,,,KERLOSSER GOAREM AR QUERCH,B957,29640,29114,Lannéanou,29,,,291140000A0368,,,,,,,,,,,,,0,,,,,T,terres,,,26352,-3.667762,48.512176
2020-354951,2020-07-31,000001,Vente,100000,,,KERLOSSER PRAT POUL FANG,B984,29640,29114,Lannéanou,29,,,291140000A0390,,,,,,,,,,,,,0,,,,,L,landes,,,2541,-3.668051,48.51092
2020-354951,2020-07-31,000001,Vente,100000,,,KERLOSSER,B929,29640,29114,Lannéanou,29,,,291140000A0587,,,,,,,,,,,,,0,,,,,T,terres,,,180,-3.668574,48.510293
2020-354951,2020-07-31,000001,Vente,100000,,,KERLOSSER,B929,29640,29114,Lannéanou,29,,,291140000A0588,,,,,,,,,,,,,0,,,,,T,terres,,,5164,-3.66796,48.510524
2020-354951,2020-07-31,000001,Vente,100000,,,KERLOSSER PARC MARCH,B977,29640,29114,Lannéanou,29,,,291140000A0598,,,,,,,,,,,,,0,,,,,T,terres,,,1155,-3.668851,48.511739
2020-354951,2020-07-31,000001,Vente,100000,,,KERLOSSER PARC MARCH,B977,29640,29114,Lannéanou,29,,,291140000A0599,,,,,,,,,,,,,0,,,,,T,terres,,,7763,-3.668962,48.512791
2020-354951,2020-07-31,000001,Vente,100000,,,KERLOSSER AR GOAREM MOAN,B938,29640,29114,Lannéanou,29,,,291140000A0635,,,,,,,,,,,,,0,,,,,T,terres,,,380,-3.67174,48.514427
2020-354951,2020-07-31,000001,Vente,100000,,,KERLOSSER AR GOAREM MOAN,B938,29640,29114,Lannéanou,29,,,291140000A0636,,,,,,,,,,,,,0,,,,,T,terres,,,38637,-3.669509,48.513961
2020-354951,2020-07-31,000001,Vente,100000,,,KERLOSSER PARC GOAREM AR G,B973,29640,29114,Lannéanou,29,,,291140000B0075,,,,,,,,,,,,,0,,,,,T,terres,,,4819,-3.663627,48.514585
2020-354951,2020-07-31,000001,Vente,100000,,,KERLOSSER GOAREM AR GLET,B955,29640,29114,Lannéanou,29,,,291140000B0076,,,,,,,,,,,,,0,,,,,BT,taillis simples,,,2097,-3.662618,48.514167
2020-354951,2020-07-31,000001,Vente,100000,,,KERLOSSER GOAREM AR GLET,B955,29640,29114,Lannéanou,29,,,291140000B0076,,,,,,,,,,,,,0,,,,,T,terres,,,19216,-3.662618,48.514167
2020-354951,2020-07-31,000001,Vente,100000,,,KERLOSSER GOAREM AR GOZ ST,B956,29640,29114,Lannéanou,29,,,291140000B0077,,,,,,,,,,,,,0,,,,,T,terres,,,8896,-3.661784,48.512523
2020-354951,2020-07-31,000001,Vente,100000,,,KERLOSSER GOAREM AR GOZ ST,B956,29640,29114,Lannéanou,29,,,291140000B0078,,,,,,,,,,,,,0,,,,,T,terres,,,18503,-3.660196,48.512421
2020-354951,2020-07-31,000001,Vente,100000,,,KERLOSSER GOAREM COZ STANG,B959,29640,29114,Lannéanou,29,,,291140000B0079,,,,,,,,,,,,,0,,,,,T,terres,,,12757,-3.660237,48.511177
2020-354951,2020-07-31,000001,Vente,100000,,,KERLOSSER PRAT NEVEZ,B983,29640,29114,Lannéanou,29,,,291140000B0116,,,,,,,,,,,,,0,,,,,P,prés,,,6191,-3.662301,48.511516
2020-354951,2020-07-31,000001,Vente,100000,,,KERLOSSER PRAT NEVEZ,B983,29640,29114,Lannéanou,29,,,291140000B0116,,,,,,,,,,,,,0,,,,,P,prés,,,6192,-3.662301,48.511516
2020-354951,2020-07-31,000001,Vente,100000,,,KERLOSSER LIORS AR MELCHEN,B964,29640,29114,Lannéanou,29,,,291140000B0124,,,,,,,,,,,,,0,,,,,T,terres,,,2239,-3.664392,48.514464
2020-354951,2020-07-31,000001,Vente,100000,,,KERLOSSER GOAREM AR FEUNTE,B954,29640,29114,Lannéanou,29,,,291140000B0125,,,,,,,,,,,,,0,,,,,T,terres,,,13716,-3.665281,48.514389
2020-354951,2020-07-31,000001,Vente,100000,,,KERLOSSER PARC ROZ PREN,B978,29640,29114,Lannéanou,29,,,291140000B0126,,,,,,,,,,,,,0,,,,,T,terres,,,13536,-3.666026,48.515392
2020-354951,2020-07-31,000001,Vente,100000,,,KERLOSSER PARC BRAS IZELLA,B972,29640,29114,Lannéanou,29,,,291140000B0127,,,,,,,,,,,,,0,,,,,T,terres,,,10800,-3.664461,48.515436
2020-354951,2020-07-31,000001,Vente,100000,,,KERLOSSER PARC BRAS HUELLA,B971,29640,29114,Lannéanou,29,,,291140000B0128,,,,,,,,,,,,,0,,,,,T,terres,,,12089,-3.663266,48.515701
2020-354951,2020-07-31,000001,Vente,100000,,,KERLOSSER AL LOSTEN,B930,29640,29114,Lannéanou,29,,,291140000B0136,,,,,,,,,,,,,0,,,,,T,terres,,,3149,-3.663634,48.517175
2020-354951,2020-07-31,000001,Vente,100000,,,KERLOSSER PARC BIAN,B970,29640,29114,Lannéanou,29,,,291140000B0137,,,,,,,,,,,,,0,,,,,T,terres,,,6786,-3.663312,48.516737
2020-354951,2020-07-31,000001,Vente,100000,,,KERLOSSER PARC AN ALLE,B965,29640,29114,Lannéanou,29,,,291140000B0138,,,,,,,,,,,,,0,,,,,T,terres,,,18926,-3.665753,48.516674
2020-354951,2020-07-31,000001,Vente,100000,,,KERLOSSER PARC HUELLA,B976,29640,29114,Lannéanou,29,,,291140000B0139,,,,,,,,,,,,,0,,,,,T,terres,,,12148,-3.666191,48.51713
2020-354951,2020-07-31,000001,Vente,100000,,,KERLOSSER AR JARDIN,B939,29640,29114,Lannéanou,29,,,291140000B0140,,,,,,,,,,,,,0,,,,,L,landes,,,197,-3.666589,48.518552
2020-354951,2020-07-31,000001,Vente,100000,,,KERLOSSER PARC GROAS PELLA,B974,29640,29114,Lannéanou,29,,,291140000B0141,,,,,,,,,,,,,0,,,,,T,terres,,,8653,-3.666264,48.518551
2020-354951,2020-07-31,000001,Vente,100000,,,KERLOSSER PARC GROAS TOSTA,B975,29640,29114,Lannéanou,29,,,291140000B0142,,,,,,,,,,,,,0,,,,,T,terres,,,9064,-3.665078,48.518493
2020-354951,2020-07-31,000001,Vente,100000,,,KERLOSSER PARC AR PAVE,B969,29640,29114,Lannéanou,29,,,291140000B0143,,,,,,,,,,,,,0,,,,,T,terres,,,10294,-3.664856,48.517518
2020-354951,2020-07-31,000001,Vente,100000,,,KERLOSSER PARC AR C HOAT,B967,29640,29114,Lannéanou,29,,,291140000B0144,,,,,,,,,,,,,0,,,,,T,terres,,,17784,-3.664007,48.518178
2020-354951,2020-07-31,000001,Vente,100000,,,KERLOSSER GOAREM AR FEUNTE,B953,29640,29114,Lannéanou,29,,,291140000B0555,,,,,,,,,,,,,0,,,,,T,terres,,,9820,-3.66479,48.512835
2020-355062,2020-08-28,000001,Vente,5000,,,ZOULQUELEN PARC AR FEUNTEU,C744,29640,29114,Lannéanou,29,,,291140000B0286,,,,,,,,,,,,,0,,,,,T,terres,,,9022,-3.654555,48.500305
2020-355062,2020-08-28,000001,Vente,5000,,,ZOULQUELEN LIORS MOAN,C734,29640,29114,Lannéanou,29,,,291140000B0382,,,,,,,,,,,,,0,,,,,T,terres,,,3079,-3.655412,48.500269
2020-355062,2020-08-28,000001,Vente,5000,,,ZOULQUELEN PARC AR C HRANG,C742,29640,29114,Lannéanou,29,,,291140000B0492,,,,,,,,,,,,,0,,,,,T,terres,,,3110,-3.656083,48.500319
2020-355062,2020-08-28,000001,Vente,5000,,,ZOULQUELEN ALLIORS,C720,29640,29114,Lannéanou,29,,,291140000B0494,,,,,,,,,,,,,0,,,,,S,sols,,,401,-3.655297,48.499669
2020-355062,2020-08-28,000001,Vente,5000,,,ZOULQUELEN ALLIORS,C720,29640,29114,Lannéanou,29,,,291140000B0495,,,,,,,,,,,,,0,,,,,VE,vergers,,,1432,-3.655111,48.499809
2020-355062,2020-08-28,000001,Vente,5000,,,TOULQUELEN,C719,29640,29114,Lannéanou,29,,,291140000B0496,,,,,,,,,,,,,0,,,,,S,sols,,,149,-3.654778,48.499513
2020-355062,2020-08-28,000001,Vente,5000,,,ZOULQUELEN LIORS ROZ,C735,29640,29114,Lannéanou,29,,,291140000B0536,,,,,,,,,,,,,0,,,,,VE,vergers,,,3142,-3.656223,48.499256
2020-355062,2020-08-28,000001,Vente,5000,,,ZOULQUELEN LIORS ROZ,C735,29640,29114,Lannéanou,29,,,291140000B0536,,,,,,,,,,,,,0,,,,,S,sols,,,313,-3.656223,48.499256
2020-355062,2020-08-28,000001,Vente,5000,,,ZOULQUELEN PARC LIN,C746,29640,29114,Lannéanou,29,,,291140000B0539,,,,,,,,,,,,,0,,,,,T,terres,,,2687,-3.656519,48.499478
2020-355062,2020-08-28,000001,Vente,5000,,,TOULQUELEN,C719,29640,29114,Lannéanou,29,,,291140000B0557,,,,,,,,,,,,,0,,,,,S,sols,,,187,-3.655631,48.499656
2020-355062,2020-08-28,000001,Vente,5000,,,ZOULQUELEN PARC AR C HRANG,C742,29640,29114,Lannéanou,29,,,291140000B0559,,,,,,,,,,,,,0,,,,,S,sols,,,2596,-3.655862,48.499794
2020-355062,2020-08-28,000001,Vente,5000,,,TOULQUELEN,C719,29640,29114,Lannéanou,29,,,291140000B0561,,,,,,,,,,,,,0,,,,,S,sols,,,995,-3.655303,48.499594
